Highlighted

Creative Cloud Install fails with error 1603

New Here ,
Apr 16, 2018

Copy link to clipboard

Copied

I have been trying to install Creative Cloud (Package Created through Package Manager) and it stops with error 1603.

I have tried to create new different packages (both 32 and 64bit) but same error.

I've been trying to install to many different machines (W10 and W8.1) but same error occurs.

I have tried solutions on article Error 1603: A fatal error occurred during Adobe Creative Suite installation

also tried Creative Cloud Cleaning tool. We are using PDQ Deploy but I have also tried installing manually from .msi file and also from setup.exe file. Same result.

I've been trying to scroll through log files but cannot find a solution. I see a lot of ppl have this issue but no real solution is provided as far as I can tell.

Below log file pastes also, could it be that Microsoft Word is causing the issues? Though I have tried installation on machines without office also with same error:

PDApp.log

04/10/18 11:34:21:974 | [INFO] |  | ASU | DeploymentManager | DeploymentManager |  |  | 1904 | Build Version - 1.14.0.97
04/10/18 11:34:21:974 | [INFO] |  | ASU | DeploymentManager | DeploymentManager |  |  | 1904 | Logging Level verbosity Set  to 4
04/10/18 11:34:21:974 | [INFO] |  | ASU | DeploymentManager | DeploymentManager |  |  | 1904 | Executing immediate custom action for install mode.
04/10/18 11:34:21:975 | [INFO] |  | ASU | DeploymentManager | DeploymentManager |  |  | 1904 | The CustomActionData string is : mode=install;sourceDir=My-packager-product-directory;installLang=
04/10/18 11:34:21:975 | [INFO] |  | ASU | DeploymentManager | DeploymentManager |  |  | 1904 | Successfully executed the immediate custom action for install mode .
04/10/18 11:34:30:485 | [INFO] |  | ASU | DeploymentManager | DeploymentManager |  |  | 3000 | Build Version - 1.14.0.97
04/10/18 11:34:30:486 | [INFO] |  | ASU | DeploymentManager | DeploymentManager |  |  | 3000 | Logging Level verbosity Set  to 4
04/10/18 11:34:30:486 | [INFO] |  | ASU | DeploymentManager | DeploymentManager |  |  | 3000 | Executing the deferred custom action.
04/10/18 11:34:30:491 | [INFO] |  | ASU | DeploymentManager | DeploymentManager |  |  | 3000 | Obtained the following as CustomActionData
04/10/18 11:34:30:491 | [INFO] |  | ASU | DeploymentManager | DeploymentManager |  |  | 3000 | (mode=install;sourceDir=C:\windows\AdminArsenal\PDQDeployRunner\service-1\exec\;installDir=;origDB=C:\windows\My-packager-product-directory.msi;installLang=)
04/10/18 11:34:30:491 | [INFO] |  | ASU | DeploymentManager | DeploymentManager |  |  | 3000 | (mode=install;sourceDir=C:\windows\AdminArsenal\PDQDeployRunner\service-1\exec\;installDir=;origDB=C:\windows\My-packager-product-directory.msi;installLang=)
04/10/18 11:34:30:491 | [INFO] |  | ASU | DeploymentManager | DeploymentManager |  |  | 3000 | Original database path is : C:\windows\My-packager-product-directory.msi
04/10/18 11:34:30:506 | [INFO] |  | ASU | DeploymentManager | DeploymentManager |  |  | 3000 | OptionXML saved at location :: C:\Users\DEPLOY~1\AppData\Local\Temp\{805409D5-EDDB-4FE6-AF7A-E81C16FE3034}\\{5C064DDC-AA70-40A7-9D20-AFCFA9CB8496}
04/10/18 11:34:30:733 | [INFO] |  | ASU | DeploymentManager | DeploymentManager |  |  | 3000 | Build Version - 1.14.0.97
04/10/18 11:34:30:733 | [INFO] |  | ASU | DeploymentManager | DeploymentManager |  |  | 3000 | Logging Level verbosity Set  to 4
04/10/18 11:34:30:733 | [INFO] |  | ASU | DeploymentManager | DeploymentManager |  |  | 3000 | CustomAction Parameters obtained...
04/10/18 11:34:30:733 | [INFO] |  | ASU | DeploymentManager | DeploymentManager |  |  | 3000 |  optXMLPath :: C:\Users\DEPLOY~1\AppData\Local\Temp\{805409D5-EDDB-4FE6-AF7A-E81C16FE3034}\\{5C064DDC-AA70-40A7-9D20-AFCFA9CB8496}
04/10/18 11:34:30:733 | [INFO] |  | ASU | DeploymentManager | DeploymentManager |  |  | 3000 |  setupBasePath :: C:\windows\My-packager-product-directory\exec\
04/10/18 11:34:30:733 | [INFO] |  | ASU | DeploymentManager | DeploymentManager |  |  | 3000 |  installDirPath ::
04/10/18 11:34:30:733 | [INFO] |  | ASU | DeploymentManager | DeploymentManager |  |  | 3000 |  installLang ::
04/10/18 11:34:30:733 | [INFO] |  | ASU | DeploymentManager | DeploymentManager |  |  | 3000 | Initializing Custom Action Data from parameters
04/10/18 11:34:30:733 | [INFO] |  | ASU | DeploymentManager | DeploymentManager |  |  | 3000 | Provisioning Tool path is (C:\Users\DEPLOY~1\AppData\Local\Temp\{805409D5-EDDB-4FE6-AF7A-E81C16FE3034}\\{B3A8E374-3019-40D4-9805-48CE11514CBD}).
04/10/18 11:34:30:734 | [INFO] |  | ASU | DeploymentManager | DeploymentManager |  |  | 3000 | Starting to run the custom action for install mode
04/10/18 11:34:30:734 | [INFO] |  | ASU | DeploymentManager | DeploymentManager |  |  | 3000 | STEP 1: Starting to parse Option XML.
04/10/18 11:34:30:755 | [WARN] |  | ASU | DeploymentManager | DeploymentManager |  |  | 3000 | Failed to initialize from ApplicationInfo.xml (C:\windows\My-packager-product-directory\ASU\packages\ApplicationInfo.xml)...
04/10/18 11:34:30:755 | [WARN] |  | ASU | DeploymentManager | DeploymentManager |  |  | 3000 | Failed to find the latest AAM version ...
04/10/18 11:34:30:757 | [INFO] |  | ASU | DeploymentManager | DeploymentManager |  |  | 3000 | Match OS lang option selected
04/10/18 11:34:30:757 | [INFO] |  | ASU | DeploymentManager | DeploymentManager |  |  | 3000 | Added OS Language (en_US) to the install language fallback.
04/10/18 11:34:30:758 | [INFO] |  | ASU | DeploymentManager | DeploymentManager |  |  | 3000 | Install language fallback contains following languages :
04/10/18 11:34:30:758 | [INFO] |  | ASU | DeploymentManager | DeploymentManager |  |  | 3000 |     (en_US)
04/10/18 11:34:30:758 | [INFO] |  | ASU | DeploymentManager | DeploymentManager |  |  | 3000 |     (fi_FI)
04/10/18 11:34:30:758 | [INFO] |  | ASU | DeploymentManager | DeploymentManager |  |  | 3000 | Self-Update BootStrapper Relative Path doesn't exist.
04/10/18 11:34:30:758 | [INFO] |  | ASU | DeploymentManager | DeploymentManager |  |  | 3000 | Failure in getting Self-Update Folder Path.
04/10/18 11:34:30:758 | [INFO] |  | ASU | DeploymentManager | DeploymentManager |  |  | 3000 | No of updates found (0).
04/10/18 11:34:30:758 | [INFO] |  | ASU | DeploymentManager | DeploymentManager |  |  | 3000 | No of HD products found (28).
04/10/18 11:34:30:765 | [ERROR] |  | ASU | DeploymentManager | DeploymentManager |  |  | 3000 | Failed to get value for conflicting processes...
04/10/18 11:34:30:765 | [WARN] |  | ASU | DeploymentManager | DeploymentManager |  |  | 3000 | Failed to parse the conflictProcessInfo for HD media (CORE1.0)...
04/10/18 11:34:30:768 | [ERROR] |  | ASU | DeploymentManager | DeploymentManager |  |  | 3000 | Failed to get value for conflicting processes...
04/10/18 11:34:30:768 | [WARN] |  | ASU | DeploymentManager | DeploymentManager |  |  | 3000 | Failed to parse the conflictProcessInfo for HD media (COPS1.0)...
04/10/18 11:34:30:772 | [ERROR] |  | ASU | DeploymentManager | DeploymentManager |  |  | 3000 | Failed to get value for conflicting processes...
04/10/18 11:34:30:772 | [WARN] |  | ASU | DeploymentManager | DeploymentManager |  |  | 3000 | Failed to parse the conflictProcessInfo for HD media (COCM1.0)...
04/10/18 11:34:30:792 | [ERROR] |  | ASU | DeploymentManager | DeploymentManager |  |  | 3000 | Failed to get value for conflicting processes...
04/10/18 11:34:30:792 | [WARN] |  | ASU | DeploymentManager | DeploymentManager |  |  | 3000 | Failed to parse the conflictProcessInfo for HD media (CDEC1.0.0)...
04/10/18 11:34:30:821 | [ERROR] |  | ASU | DeploymentManager | DeploymentManager |  |  | 3000 | Failed to get value for conflicting processes...
04/10/18 11:34:30:821 | [WARN] |  | ASU | DeploymentManager | DeploymentManager |  |  | 3000 | Failed to parse the conflictProcessInfo for HD media (DOTN4.5.2)...
04/10/18 11:34:30:853 | [ERROR] |  | ASU | DeploymentManager | DeploymentManager |  |  | 3000 | Failed to get value for conflicting processes...
04/10/18 11:34:30:853 | [WARN] |  | ASU | DeploymentManager | DeploymentManager |  |  | 3000 | Failed to parse the conflictProcessInfo for HD media (COSY2.4.4)...
04/10/18 11:34:30:853 | [INFO] |  | ASU | DeploymentManager | DeploymentManager |  |  | 3000 | The media info tag marked for auto-install (COSY) (2.4.4)
04/10/18 11:34:30:857 | [ERROR] |  | ASU | DeploymentManager | DeploymentManager |  |  | 3000 | Failed to get value for conflicting processes...
04/10/18 11:34:30:857 | [WARN] |  | ASU | DeploymentManager | DeploymentManager |  |  | 3000 | Failed to parse the conflictProcessInfo for HD media (PSTI1.3.2)...
04/10/18 11:34:30:861 | [ERROR] |  | ASU | DeploymentManager | DeploymentManager |  |  | 3000 | Failed to get value for conflicting processes...
04/10/18 11:34:30:861 | [WARN] |  | ASU | DeploymentManager | DeploymentManager |  |  | 3000 | Failed to parse the conflictProcessInfo for HD media (COMP1.1)...
04/10/18 11:34:30:864 | [ERROR] |  | ASU | DeploymentManager | DeploymentManager |  |  | 3000 | Failed to get value for conflicting processes...
04/10/18 11:34:30:864 | [WARN] |  | ASU | DeploymentManager | DeploymentManager |  |  | 3000 | Failed to parse the conflictProcessInfo for HD media (CORG1.1)...
04/10/18 11:34:30:874 | [INFO] |  | ASU | DeploymentManager | DeploymentManager |  |  | 3000 | Custom deployment path doesnt exist in options XML
04/10/18 11:34:30:874 | [WARN] |  | ASU | DeploymentManager | DeploymentManager |  |  | 3000 | Failed to find Royalty Bearing attribute info.
04/10/18 11:34:30:874 | [INFO] |  | ASU | DeploymentManager | DeploymentManager |  |  | 3000 | Found the AppsPanel attribute info (true)
04/10/18 11:34:30:874 | [INFO] |  | ASU | DeploymentManager | DeploymentManager |  |  | 3000 | Found the AdminPrivilege attribute info (false)
04/10/18 11:34:30:874 | [INFO] |  | ASU | DeploymentManager | DeploymentManager |  |  | 3000 | Number of Medias found = 1

04/10/18 11:34:30:884 | [INFO] |  | ASU | DeploymentManager | DeploymentManager |  |  | 3000 | Deployment XML created at path :: C:\Users\DEPLOY~1\AppData\Local\Temp\{7553B765-296A-489B-94A6-D8BE5E748017}\\{ED361388-6A5A-4726-A22A-61723C4321F5}
04/10/18 11:34:30:901 | [INFO] |  | ASU | DeploymentManager | DeploymentManager |  |  | 3000 | Override XML created at path :: C:\Users\DEPLOY~1\AppData\Local\Temp\{7553B765-296A-489B-94A6-D8BE5E748017}\\{B07A332E-B0A3-4A1C-AA42-581BDB803B18}
04/10/18 11:34:30:902 | [INFO] |  | ASU | DeploymentManager | DeploymentManager |  |  | 3000 | Conflict process info retrieved (<ConflictingProcess headless="false" forceKillAllowed="false" adobeOwned="false">
<RegularExpression>^[Ww][Ii][Nn][Ww][Oo][Rr][Dd]\.[Ee][Xx][Ee]$</RegularExpression>
<ProcessDisplayName>Microsoft Word</ProcessDisplayName>
<ParentRegularExpression></ParentRegularExpression>
<ParentDisplayName></ParentDisplayName>
<RelativePath></RelativePath>
</ConflictingProcess><ConflictingProcess headless="false" forceKillAllowed="false" adobeOwned="true">
<RegularExpression>^[Aa][Cc][Rr][Oo][Bb][Aa][Tt]\.[Ee][Xx][Ee]$</RegularExpression>
<ProcessDisplayName>Adobe Acrobat 2017</ProcessDisplayName>
<ParentRegularExpression></ParentRegularExpression>
<ParentDisplayName></ParentDisplayName>
<RelativePath>[INSTALLDIR]\Acrobat 2017\Acrobat\Acrobat.exe</RelativePath>
</ConflictingProcess><ConflictingProcess headless="false" forceKillAllowed="false" adobeOwned="true">
<RegularExpression>^[Aa][Cc][Rr][Oo][Bb][Aa][Tt]\.[Ee][Xx][Ee]$</RegularExpression>
<ProcessDisplayName>
04/10/18 11:34:30:902 | [INFO] |  | ASU | DeploymentManager | DeploymentManager |  |  | 3000 | Deployment Manager is running in Install Mode.
04/10/18 11:34:30:903 | [INFO] |  | ASU | DeploymentManager | DeploymentManager |  |  | 3000 | STEP 2: Starting to launch ASU AAM.
04/10/18 11:34:30:903 | [INFO] |  | ASU | DeploymentManager | DeploymentManager |  |  | 3000 | Bootstrapper launch location is :: C:\windows\My-packager-product-directory\ASU\Set-up.dat
04/10/18 11:34:30:905 | [INFO] |  | ASU | DeploymentManager | DeploymentManager |  |  | 3000 | Build Version - 1.14.0.97
04/10/18 11:34:30:905 | [INFO] |  | ASU | DeploymentManager | DeploymentManager |  |  | 3000 | Logging Level verbosity Set  to 4
04/10/18 11:34:30:905 | [FATAL] |  | ASU | DeploymentManager | DeploymentManager |  |  | 3000 | Failed to launch the Bootstrapper process.Stopping the installation process.
04/10/18 11:34:30:906 | [ERROR] |  | ASU | DeploymentManager | DeploymentManager |  |  | 3000 | Failed to get/verify the UpdaterCore inventory base path (C:\Program Files (x86)\Common Files\Adobe\AAMUpdaterInventory\1.0\)
04/10/18 11:34:30:906 | [WARN] |  | ASU | DeploymentManager | DeploymentManager |  |  | 3000 | sendAnalytics : Unable to find deviceId.
04/10/18 11:34:30:959 | [INFO] |  | ASU | DeploymentManager | AAMEEUtilities |  |  | 3000 | The output of process received  in execWithOutput :
Microsoft Windows [Version 10.0.16299.125]

04/10/18 11:34:30:960 | [INFO] |  | ASU | DeploymentManager |  |  |  | 3000 | Event Guid generated is: '482ea179-45a3-42a3-81fc-c89b588a73cf'
04/10/18 11:34:30:975 | [INFO] |  | ASU | DeploymentManager |  |  | HTTPConnector | 3000 | GetIEProxyInfo - Failed to get proxy for the url, error:12180
04/10/18 11:34:31:628 | [INFO] |  | ASU | DeploymentManager |  |  | HTTPConnector | 3636 | HTTP Request Status code 200.
04/10/18 11:34:31:629 | [INFO] |  | ASU | DeploymentManager |  |  | HTTPConnector | 3000 | The http request returned HTTP_Status:0 HttpCommunicator error:0
04/10/18 11:34:31:632 | [INFO] |  | ASU | DeploymentManager |  |  |  | 3000 | Waiting for the async thread to get the task completed
04/10/18 11:34:31:632 | [INFO] |  | ASU | DeploymentManager |  |  |  | 3576 | Async thread is completed. Now exiting from function.
04/10/18 11:34:31:635 | [INFO] |  | ASU | DeploymentManager | DeploymentManager |  |  | 3000 | The install workflow is terminating.
04/16/18 11:28:28:764 | [INFO] |  | ASU | DeploymentManager | DeploymentManager |  |  | 1356 | Build Version - 1.14.0.97
04/16/18 11:28:28:764 | [INFO] |  | ASU | DeploymentManager | DeploymentManager |  |  | 1356 | Logging Level verbosity Set  to 4
04/16/18 11:28:28:764 | [INFO] |  | ASU | DeploymentManager | DeploymentManager |  |  | 1356 | Executing immediate custom action for install mode.
04/16/18 11:28:28:764 | [INFO] |  | ASU | DeploymentManager | DeploymentManager |  |  | 1356 | The CustomActionData string is : mode=install;sourceDir=C:\windows\My-packager-product-directory.msi;installLang=
04/16/18 11:28:28:765 | [INFO] |  | ASU | DeploymentManager | DeploymentManager |  |  | 1356 | Successfully executed the immediate custom action for install mode .
04/16/18 11:28:36:594 | [INFO] |  | ASU | DeploymentManager | DeploymentManager |  |  | 1112 | Build Version - 1.14.0.97
04/16/18 11:28:36:594 | [INFO] |  | ASU | DeploymentManager | DeploymentManager |  |  | 1112 | Logging Level verbosity Set  to 4
04/16/18 11:28:36:594 | [INFO] |  | ASU | DeploymentManager | DeploymentManager |  |  | 1112 | Executing the deferred custom action.
04/16/18 11:28:36:605 | [INFO] |  | ASU | DeploymentManager | DeploymentManager |  |  | 1112 | Obtained the following as CustomActionData
04/16/18 11:28:36:606 | [INFO] |  | ASU | DeploymentManager | DeploymentManager |  |  | 1112 | (mode=install;sourceDir=C:\windows\AdminArsenal\PDQDeployRunner\service-1\exec\;installDir=;origDB=C:\windows\My-packager-product-directory.msi;installLang=)
04/16/18 11:28:36:606 | [INFO] |  | ASU | DeploymentManager | DeploymentManager |  |  | 1112 | (mode=install;sourceDir=C:\windows\AdminArsenal\PDQDeployRunner\service-1\exec\;installDir=;origDB=C:\windows\My-packager-product-directory.msi;installLang=)
04/16/18 11:28:36:606 | [INFO] |  | ASU | DeploymentManager | DeploymentManager |  |  | 1112 | Original database path is : C:\windows\My-packager-product-directory.msi
04/16/18 11:28:36:613 | [INFO] |  | ASU | DeploymentManager | DeploymentManager |  |  | 1112 | OptionXML saved at location :: C:\Users\DEPLOY~1\AppData\Local\Temp\{9EC511FF-E200-417C-ABD2-DE592F6C2117}\\{37D744A2-AB12-49FC-9FB2-4BE05BA94D49}
04/16/18 11:28:36:631 | [INFO] |  | ASU | DeploymentManager | DeploymentManager |  |  | 1112 | Build Version - 1.14.0.97
04/16/18 11:28:36:631 | [INFO] |  | ASU | DeploymentManager | DeploymentManager |  |  | 1112 | Logging Level verbosity Set  to 4
04/16/18 11:28:36:631 | [INFO] |  | ASU | DeploymentManager | DeploymentManager |  |  | 1112 | CustomAction Parameters obtained...
04/16/18 11:28:36:631 | [INFO] |  | ASU | DeploymentManager | DeploymentManager |  |  | 1112 |  optXMLPath :: C:\Users\DEPLOY~1\AppData\Local\Temp\{9EC511FF-E200-417C-ABD2-DE592F6C2117}\\{37D744A2-AB12-49FC-9FB2-4BE05BA94D49}
04/16/18 11:28:36:632 | [INFO] |  | ASU | DeploymentManager | DeploymentManager |  |  | 1112 |  setupBasePath :: C:\windows\AdminArsenal\PDQDeployRunner\service-1\exec\
04/16/18 11:28:36:632 | [INFO] |  | ASU | DeploymentManager | DeploymentManager |  |  | 1112 |  installDirPath ::
04/16/18 11:28:36:632 | [INFO] |  | ASU | DeploymentManager | DeploymentManager |  |  | 1112 |  installLang ::
04/16/18 11:28:36:632 | [INFO] |  | ASU | DeploymentManager | DeploymentManager |  |  | 1112 | Initializing Custom Action Data from parameters
04/16/18 11:28:36:632 | [INFO] |  | ASU | DeploymentManager | DeploymentManager |  |  | 1112 | Provisioning Tool path is (C:\Users\DEPLOY~1\AppData\Local\Temp\{9EC511FF-E200-417C-ABD2-DE592F6C2117}\\{D5CC80B0-44DF-446B-8CC3-E7EA9AC53231}).
04/16/18 11:28:36:635 | [INFO] |  | ASU | DeploymentManager | DeploymentManager |  |  | 1112 | Starting to run the custom action for install mode
04/16/18 11:28:36:636 | [INFO] |  | ASU | DeploymentManager | DeploymentManager |  |  | 1112 | STEP 1: Starting to parse Option XML.
04/16/18 11:28:36:652 | [WARN] |  | ASU | DeploymentManager | DeploymentManager |  |  | 1112 | Failed to initialize from ApplicationInfo.xml (C:\windows\My-packager-product-directory\packages\ApplicationInfo.xml)...
04/16/18 11:28:36:652 | [WARN] |  | ASU | DeploymentManager | DeploymentManager |  |  | 1112 | Failed to find the latest AAM version ...
04/16/18 11:28:36:654 | [INFO] |  | ASU | DeploymentManager | DeploymentManager |  |  | 1112 | Match OS lang option selected
04/16/18 11:28:36:654 | [INFO] |  | ASU | DeploymentManager | DeploymentManager |  |  | 1112 | Added OS Language (en_US) to the install language fallback.
04/16/18 11:28:36:655 | [INFO] |  | ASU | DeploymentManager | DeploymentManager |  |  | 1112 | Install language fallback contains following languages :
04/16/18 11:28:36:655 | [INFO] |  | ASU | DeploymentManager | DeploymentManager |  |  | 1112 |     (en_US)
04/16/18 11:28:36:655 | [INFO] |  | ASU | DeploymentManager | DeploymentManager |  |  | 1112 |     (fi_FI)
04/16/18 11:28:36:655 | [INFO] |  | ASU | DeploymentManager | DeploymentManager |  |  | 1112 | Self-Update BootStrapper Relative Path doesn't exist.
04/16/18 11:28:36:655 | [INFO] |  | ASU | DeploymentManager | DeploymentManager |  |  | 1112 | Failure in getting Self-Update Folder Path.
04/16/18 11:28:36:655 | [INFO] |  | ASU | DeploymentManager | DeploymentManager |  |  | 1112 | No of updates found (0).
04/16/18 11:28:36:655 | [INFO] |  | ASU | DeploymentManager | DeploymentManager |  |  | 1112 | No of HD products found (8).
04/16/18 11:28:36:662 | [ERROR] |  | ASU | DeploymentManager | DeploymentManager |  |  | 1112 | Failed to get value for conflicting processes...
04/16/18 11:28:36:662 | [WARN] |  | ASU | DeploymentManager | DeploymentManager |  |  | 1112 | Failed to parse the conflictProcessInfo for HD media (CORE1.0)...
04/16/18 11:28:36:665 | [ERROR] |  | ASU | DeploymentManager | DeploymentManager |  |  | 1112 | Failed to get value for conflicting processes...
04/16/18 11:28:36:665 | [WARN] |  | ASU | DeploymentManager | DeploymentManager |  |  | 1112 | Failed to parse the conflictProcessInfo for HD media (COPS1.0)...
04/16/18 11:28:36:668 | [ERROR] |  | ASU | DeploymentManager | DeploymentManager |  |  | 1112 | Failed to get value for conflicting processes...
04/16/18 11:28:36:668 | [WARN] |  | ASU | DeploymentManager | DeploymentManager |  |  | 1112 | Failed to parse the conflictProcessInfo for HD media (COCM1.0)...
04/16/18 11:28:36:675 | [ERROR] |  | ASU | DeploymentManager | DeploymentManager |  |  | 1112 | Failed to get value for conflicting processes...
04/16/18 11:28:36:675 | [WARN] |  | ASU | DeploymentManager | DeploymentManager |  |  | 1112 | Failed to parse the conflictProcessInfo for HD media (CORG1.1)...
04/16/18 11:28:36:684 | [ERROR] |  | ASU | DeploymentManager | DeploymentManager |  |  | 1112 | Failed to get value for conflicting processes...
04/16/18 11:28:36:684 | [WARN] |  | ASU | DeploymentManager | DeploymentManager |  |  | 1112 | Failed to parse the conflictProcessInfo for HD media (COSY2.4.6)...
04/16/18 11:28:36:684 | [INFO] |  | ASU | DeploymentManager | DeploymentManager |  |  | 1112 | The media info tag marked for auto-install (COSY) (2.4.6)
04/16/18 11:28:36:687 | [INFO] |  | ASU | DeploymentManager | DeploymentManager |  |  | 1112 | Custom deployment path doesnt exist in options XML
04/16/18 11:28:36:687 | [WARN] |  | ASU | DeploymentManager | DeploymentManager |  |  | 1112 | Failed to find Royalty Bearing attribute info.
04/16/18 11:28:36:687 | [INFO] |  | ASU | DeploymentManager | DeploymentManager |  |  | 1112 | Found the AppsPanel attribute info (false)
04/16/18 11:28:36:687 | [INFO] |  | ASU | DeploymentManager | DeploymentManager |  |  | 1112 | Found the AdminPrivilege attribute info (false)
04/16/18 11:28:36:687 | [INFO] |  | ASU | DeploymentManager | DeploymentManager |  |  | 1112 | Number of Medias found = 1

04/16/18 11:28:36:713 | [INFO] |  | ASU | DeploymentManager | DeploymentManager |  |  | 1112 | Deployment XML created at path :: C:\Users\DEPLOY~1\AppData\Local\Temp\{81C39BF2-A3E2-458F-90F0-C6A1A29A979B}\\{154BEC3E-EC45-4672-8E41-65245116DB95}
04/16/18 11:28:36:721 | [INFO] |  | ASU | DeploymentManager | DeploymentManager |  |  | 1112 | Override XML created at path :: C:\Users\DEPLOY~1\AppData\Local\Temp\{81C39BF2-A3E2-458F-90F0-C6A1A29A979B}\\{C384C655-8B2E-4981-8662-8164FC45A822}
04/16/18 11:28:36:722 | [INFO] |  | ASU | DeploymentManager | DeploymentManager |  |  | 1112 | Conflict process info retrieved (<ConflictingProcess headless="false" forceKillAllowed="false" adobeOwned="false">
<RegularExpression>^[Ww][Ii][Nn][Ww][Oo][Rr][Dd]\.[Ee][Xx][Ee]$</RegularExpression>
<ProcessDisplayName>Microsoft Word</ProcessDisplayName>
<ParentRegularExpression></ParentRegularExpression>
<ParentDisplayName></ParentDisplayName>
<RelativePath></RelativePath>
</ConflictingProcess><ConflictingProcess headless="false" forceKillAllowed="false" adobeOwned="true">
<RegularExpression>^[Aa][Cc][Rr][Oo][Bb][Aa][Tt]\.[Ee][Xx][Ee]$</RegularExpression>
<ProcessDisplayName>Adobe Acrobat 2017</ProcessDisplayName>
<ParentRegularExpression></ParentRegularExpression>
<ParentDisplayName></ParentDisplayName>
<RelativePath>[INSTALLDIR]\Acrobat 2017\Acrobat\Acrobat.exe</RelativePath>
</ConflictingProcess><ConflictingProcess headless="false" forceKillAllowed="false" adobeOwned="true">
<RegularExpression>^[Aa][Cc][Rr][Oo][Bb][Aa][Tt]\.[Ee][Xx][Ee]$</RegularExpression>
<ProcessDisplayName>
04/16/18 11:28:36:722 | [INFO] |  | ASU | DeploymentManager | DeploymentManager |  |  | 1112 | Deployment Manager is running in Install Mode.
04/16/18 11:28:36:722 | [INFO] |  | ASU | DeploymentManager | DeploymentManager |  |  | 1112 | STEP 2: Starting to launch ASU AAM.
04/16/18 11:28:36:722 | [INFO] |  | ASU | DeploymentManager | DeploymentManager |  |  | 1112 | Bootstrapper launch location is :: C:\windows\My-packager-product-directory\ASU\Set-up.dat
04/16/18 11:28:36:723 | [INFO] |  | ASU | DeploymentManager | DeploymentManager |  |  | 1112 | Build Version - 1.14.0.97
04/16/18 11:28:36:723 | [INFO] |  | ASU | DeploymentManager | DeploymentManager |  |  | 1112 | Logging Level verbosity Set  to 4
04/16/18 11:28:36:723 | [FATAL] |  | ASU | DeploymentManager | DeploymentManager |  |  | 1112 | Failed to launch the Bootstrapper process.Stopping the installation process.
04/16/18 11:28:36:725 | [ERROR] |  | ASU | DeploymentManager | DeploymentManager |  |  | 1112 | Failed to get/verify the UpdaterCore inventory base path (C:\Program Files (x86)\Common Files\Adobe\AAMUpdaterInventory\1.0\)
04/16/18 11:28:36:725 | [WARN] |  | ASU | DeploymentManager | DeploymentManager |  |  | 1112 | sendAnalytics : Unable to find deviceId.
04/16/18 11:28:36:772 | [INFO] |  | ASU | DeploymentManager | AAMEEUtilities |  |  | 1112 | The output of process received  in execWithOutput :
Microsoft Windows [Version 10.0.16299.125]

04/16/18 11:28:36:776 | [INFO] |  | ASU | DeploymentManager |  |  |  | 1112 | Event Guid generated is: '90652ffa-71e5-4bdb-8893-cd6144deef61'
04/16/18 11:28:36:786 | [INFO] |  | ASU | DeploymentManager |  |  | HTTPConnector | 1112 | GetIEProxyInfo - Failed to get proxy for the url, error:12180
04/16/18 11:28:37:374 | [INFO] |  | ASU | DeploymentManager |  |  | HTTPConnector | 5476 | HTTP Request Status code 200.
04/16/18 11:28:37:375 | [INFO] |  | ASU | DeploymentManager |  |  | HTTPConnector | 1112 | The http request returned HTTP_Status:0 HttpCommunicator error:0
04/16/18 11:28:37:393 | [INFO] |  | ASU | DeploymentManager |  |  |  | 1112 | Waiting for the async thread to get the task completed
04/16/18 11:28:37:393 | [INFO] |  | ASU | DeploymentManager |  |  |  | 7684 | Async thread is completed. Now exiting from function.
04/16/18 11:28:37:396 | [INFO] |  | ASU | DeploymentManager | DeploymentManager |  |  | 1112 | The install workflow is terminating.
04/16/18 11:39:27:542 | [INFO] |  | ASU | DeploymentManager | DeploymentManager |  |  | 6776 | Build Version - 1.14.0.97
04/16/18 11:39:27:543 | [INFO] |  | ASU | DeploymentManager | DeploymentManager |  |  | 6776 | Logging Level verbosity Set  to 4
04/16/18 11:39:27:543 | [INFO] |  | ASU | DeploymentManager | DeploymentManager |  |  | 6776 | Executing immediate custom action for install mode.
04/16/18 11:39:27:543 | [INFO] |  | ASU | DeploymentManager | DeploymentManager |  |  | 6776 | The CustomActionData string is : mode=install;sourceDir=C:\windows\AdminArsenal\PDQDeployRunner\service-1\exec\;installDir=;origDB=C:\windows\My-packager-product-directory.msi;installLang=
04/16/18 11:39:27:543 | [INFO] |  | ASU | DeploymentManager | DeploymentManager |  |  | 6776 | Successfully executed the immediate custom action for install mode .
04/16/18 11:39:36:417 | [INFO] |  | ASU | DeploymentManager | DeploymentManager |  |  | 4796 | Build Version - 1.14.0.97
04/16/18 11:39:36:417 | [INFO] |  | ASU | DeploymentManager | DeploymentManager |  |  | 4796 | Logging Level verbosity Set  to 4
04/16/18 11:39:36:417 | [INFO] |  | ASU | DeploymentManager | DeploymentManager |  |  | 4796 | Executing the deferred custom action.
04/16/18 11:39:36:423 | [INFO] |  | ASU | DeploymentManager | DeploymentManager |  |  | 4796 | Obtained the following as CustomActionData
04/16/18 11:39:36:423 | [INFO] |  | ASU | DeploymentManager | DeploymentManager |  |  | 4796 | (mode=install;sourceDir=C:\windows\AdminArsenal\PDQDeployRunner\service-1\exec\;installDir=;origDB=C:\windows\My-packager-product-directory.msi;installLang=)
04/16/18 11:39:36:423 | [INFO] |  | ASU | DeploymentManager | DeploymentManager |  |  | 4796 | (mode=install;sourceDir=C:\windows\AdminArsenal\PDQDeployRunner\service-1\exec\;installDir=;origDB=C:\windows\My-packager-product-directory.msi;installLang=)
04/16/18 11:39:36:423 | [INFO] |  | ASU | DeploymentManager | DeploymentManager |  |  | 4796 | Original database path is : C:\windows\My-packager-product-directory.msi
04/16/18 11:39:36:430 | [INFO] |  | ASU | DeploymentManager | DeploymentManager |  |  | 4796 | OptionXML saved at location :: C:\Users\DEPLOY~1\AppData\Local\Temp\{A2047C20-3B33-432B-B194-83BF403F394E}\\{4616B0A5-D805-4AF7-92CF-830B5A081B59}
04/16/18 11:39:36:447 | [INFO] |  | ASU | DeploymentManager | DeploymentManager |  |  | 4796 | Build Version - 1.14.0.97
04/16/18 11:39:36:447 | [INFO] |  | ASU | DeploymentManager | DeploymentManager |  |  | 4796 | Logging Level verbosity Set  to 4
04/16/18 11:39:36:447 | [INFO] |  | ASU | DeploymentManager | DeploymentManager |  |  | 4796 | CustomAction Parameters obtained...
04/16/18 11:39:36:447 | [INFO] |  | ASU | DeploymentManager | DeploymentManager |  |  | 4796 |  optXMLPath :: C:\Users\DEPLOY~1\AppData\Local\Temp\{A2047C20-3B33-432B-B194-83BF403F394E}\\{4616B0A5-D805-4AF7-92CF-830B5A081B59}
04/16/18 11:39:36:447 | [INFO] |  | ASU | DeploymentManager | DeploymentManager |  |  | 4796 |  setupBasePath :: C:\windows\AdminArsenal\PDQDeployRunner\service-1\exec\
04/16/18 11:39:36:447 | [INFO] |  | ASU | DeploymentManager | DeploymentManager |  |  | 4796 |  installDirPath ::
04/16/18 11:39:36:447 | [INFO] |  | ASU | DeploymentManager | DeploymentManager |  |  | 4796 |  installLang ::
04/16/18 11:39:36:447 | [INFO] |  | ASU | DeploymentManager | DeploymentManager |  |  | 4796 | Initializing Custom Action Data from parameters
04/16/18 11:39:36:447 | [INFO] |  | ASU | DeploymentManager | DeploymentManager |  |  | 4796 | Provisioning Tool path is (C:\Users\DEPLOY~1\AppData\Local\Temp\{A2047C20-3B33-432B-B194-83BF403F394E}\\{46052B71-8569-408D-ACFA-1571E03F5C91}).
04/16/18 11:39:36:451 | [INFO] |  | ASU | DeploymentManager | DeploymentManager |  |  | 4796 | Starting to run the custom action for install mode
04/16/18 11:39:36:451 | [INFO] |  | ASU | DeploymentManager | DeploymentManager |  |  | 4796 | STEP 1: Starting to parse Option XML.
04/16/18 11:39:36:455 | [WARN] |  | ASU | DeploymentManager | DeploymentManager |  |  | 4796 | Failed to initialize from ApplicationInfo.xml (C:\windowsMy-packager-product-directory\ASU\packages\ApplicationInfo.xml)...
04/16/18 11:39:36:456 | [WARN] |  | ASU | DeploymentManager | DeploymentManager |  |  | 4796 | Failed to find the latest AAM version ...
04/16/18 11:39:36:456 | [INFO] |  | ASU | DeploymentManager | DeploymentManager |  |  | 4796 | Match OS lang option selected
04/16/18 11:39:36:456 | [INFO] |  | ASU | DeploymentManager | DeploymentManager |  |  | 4796 | Added OS Language (en_US) to the install language fallback.
04/16/18 11:39:36:456 | [INFO] |  | ASU | DeploymentManager | DeploymentManager |  |  | 4796 | Install language fallback contains following languages :
04/16/18 11:39:36:456 | [INFO] |  | ASU | DeploymentManager | DeploymentManager |  |  | 4796 |     (en_US)
04/16/18 11:39:36:456 | [INFO] |  | ASU | DeploymentManager | DeploymentManager |  |  | 4796 |     (fi_FI)
04/16/18 11:39:36:456 | [INFO] |  | ASU | DeploymentManager | DeploymentManager |  |  | 4796 | Self-Update BootStrapper Relative Path doesn't exist.
04/16/18 11:39:36:456 | [INFO] |  | ASU | DeploymentManager | DeploymentManager |  |  | 4796 | Failure in getting Self-Update Folder Path.
04/16/18 11:39:36:456 | [INFO] |  | ASU | DeploymentManager | DeploymentManager |  |  | 4796 | No of updates found (0).
04/16/18 11:39:36:456 | [INFO] |  | ASU | DeploymentManager | DeploymentManager |  |  | 4796 | No of HD products found (8).
04/16/18 11:39:36:460 | [ERROR] |  | ASU | DeploymentManager | DeploymentManager |  |  | 4796 | Failed to get value for conflicting processes...
04/16/18 11:39:36:460 | [WARN] |  | ASU | DeploymentManager | DeploymentManager |  |  | 4796 | Failed to parse the conflictProcessInfo for HD media (CORE1.0)...
04/16/18 11:39:36:463 | [ERROR] |  | ASU | DeploymentManager | DeploymentManager |  |  | 4796 | Failed to get value for conflicting processes...
04/16/18 11:39:36:463 | [WARN] |  | ASU | DeploymentManager | DeploymentManager |  |  | 4796 | Failed to parse the conflictProcessInfo for HD media (COPS1.0)...
04/16/18 11:39:36:466 | [ERROR] |  | ASU | DeploymentManager | DeploymentManager |  |  | 4796 | Failed to get value for conflicting processes...
04/16/18 11:39:36:466 | [WARN] |  | ASU | DeploymentManager | DeploymentManager |  |  | 4796 | Failed to parse the conflictProcessInfo for HD media (COCM1.0)...
04/16/18 11:39:36:473 | [ERROR] |  | ASU | DeploymentManager | DeploymentManager |  |  | 4796 | Failed to get value for conflicting processes...
04/16/18 11:39:36:474 | [WARN] |  | ASU | DeploymentManager | DeploymentManager |  |  | 4796 | Failed to parse the conflictProcessInfo for HD media (CORG1.1)...
04/16/18 11:39:36:482 | [ERROR] |  | ASU | DeploymentManager | DeploymentManager |  |  | 4796 | Failed to get value for conflicting processes...
04/16/18 11:39:36:482 | [WARN] |  | ASU | DeploymentManager | DeploymentManager |  |  | 4796 | Failed to parse the conflictProcessInfo for HD media (COSY2.4.6)...
04/16/18 11:39:36:482 | [INFO] |  | ASU | DeploymentManager | DeploymentManager |  |  | 4796 | The media info tag marked for auto-install (COSY) (2.4.6)
04/16/18 11:39:36:485 | [INFO] |  | ASU | DeploymentManager | DeploymentManager |  |  | 4796 | Custom deployment path doesnt exist in options XML
04/16/18 11:39:36:485 | [WARN] |  | ASU | DeploymentManager | DeploymentManager |  |  | 4796 | Failed to find Royalty Bearing attribute info.
04/16/18 11:39:36:485 | [INFO] |  | ASU | DeploymentManager | DeploymentManager |  |  | 4796 | Found the AppsPanel attribute info (false)
04/16/18 11:39:36:485 | [INFO] |  | ASU | DeploymentManager | DeploymentManager |  |  | 4796 | Found the AdminPrivilege attribute info (false)
04/16/18 11:39:36:485 | [INFO] |  | ASU | DeploymentManager | DeploymentManager |  |  | 4796 | Number of Medias found = 1

04/16/18 11:39:36:513 | [INFO] |  | ASU | DeploymentManager | DeploymentManager |  |  | 4796 | Deployment XML created at path :: C:\Users\DEPLOY~1\AppData\Local\Temp\{D198725F-ABB3-4DCD-9388-35B3F474686F}\\{A382FD88-16DC-420C-A715-36C3074F947A}
04/16/18 11:39:36:521 | [INFO] |  | ASU | DeploymentManager | DeploymentManager |  |  | 4796 | Override XML created at path :: C:\Users\DEPLOY~1\AppData\Local\Temp\{D198725F-ABB3-4DCD-9388-35B3F474686F}\\{4EF73C27-1C9C-46F9-99ED-D2D683F3B1E7}
04/16/18 11:39:36:523 | [INFO] |  | ASU | DeploymentManager | DeploymentManager |  |  | 4796 | Conflict process info retrieved (<ConflictingProcess headless="false" forceKillAllowed="false" adobeOwned="false">
<RegularExpression>^[Ww][Ii][Nn][Ww][Oo][Rr][Dd]\.[Ee][Xx][Ee]$</RegularExpression>
<ProcessDisplayName>Microsoft Word</ProcessDisplayName>
<ParentRegularExpression></ParentRegularExpression>
<ParentDisplayName></ParentDisplayName>
<RelativePath></RelativePath>
</ConflictingProcess><ConflictingProcess headless="false" forceKillAllowed="false" adobeOwned="true">
<RegularExpression>^[Aa][Cc][Rr][Oo][Bb][Aa][Tt]\.[Ee][Xx][Ee]$</RegularExpression>
<ProcessDisplayName>Adobe Acrobat 2017</ProcessDisplayName>
<ParentRegularExpression></ParentRegularExpression>
<ParentDisplayName></ParentDisplayName>
<RelativePath>[INSTALLDIR]\Acrobat 2017\Acrobat\Acrobat.exe</RelativePath>
</ConflictingProcess><ConflictingProcess headless="false" forceKillAllowed="false" adobeOwned="true">
<RegularExpression>^[Aa][Cc][Rr][Oo][Bb][Aa][Tt]\.[Ee][Xx][Ee]$</RegularExpression>
<ProcessDisplayName>
04/16/18 11:39:36:523 | [INFO] |  | ASU | DeploymentManager | DeploymentManager |  |  | 4796 | Deployment Manager is running in Install Mode.
04/16/18 11:39:36:524 | [INFO] |  | ASU | DeploymentManager | DeploymentManager |  |  | 4796 | STEP 2: Starting to launch ASU AAM.
04/16/18 11:39:36:524 | [INFO] |  | ASU | DeploymentManager | DeploymentManager |  |  | 4796 | Bootstrapper launch location is :: C:\windows\AdminArsenal\PDQDeployRunner\service-1\exec\ASU\Set-up.dat
04/16/18 11:39:36:526 | [INFO] |  | ASU | DeploymentManager | DeploymentManager |  |  | 4796 | Build Version - 1.14.0.97
04/16/18 11:39:36:527 | [INFO] |  | ASU | DeploymentManager | DeploymentManager |  |  | 4796 | Logging Level verbosity Set  to 4
04/16/18 11:39:36:527 | [FATAL] |  | ASU | DeploymentManager | DeploymentManager |  |  | 4796 | Failed to launch the Bootstrapper process.Stopping the installation process.
04/16/18 11:39:36:529 | [ERROR] |  | ASU | DeploymentManager | DeploymentManager |  |  | 4796 | Failed to get/verify the UpdaterCore inventory base path (C:\Program Files (x86)\Common Files\Adobe\AAMUpdaterInventory\1.0\)
04/16/18 11:39:36:529 | [WARN] |  | ASU | DeploymentManager | DeploymentManager |  |  | 4796 | sendAnalytics : Unable to find deviceId.
04/16/18 11:39:36:609 | [INFO] |  | ASU | DeploymentManager | AAMEEUtilities |  |  | 4796 | The output of process received  in execWithOutput :
Microsoft Windows [Version 10.0.16299.125]

04/16/18 11:39:36:612 | [INFO] |  | ASU | DeploymentManager |  |  |  | 4796 | Event Guid generated is: '01d76335-5d8b-493f-be80-337f321662a3'
04/16/18 11:39:36:625 | [INFO] |  | ASU | DeploymentManager |  |  | HTTPConnector | 4796 | GetIEProxyInfo - Failed to get proxy for the url, error:12180
04/16/18 11:39:37:166 | [INFO] |  | ASU | DeploymentManager |  |  | HTTPConnector | 2316 | HTTP Request Status code 200.
04/16/18 11:39:37:166 | [INFO] |  | ASU | DeploymentManager |  |  | HTTPConnector | 4796 | The http request returned HTTP_Status:0 HttpCommunicator error:0
04/16/18 11:39:37:168 | [INFO] |  | ASU | DeploymentManager |  |  |  | 4796 | Waiting for the async thread to get the task completed
04/16/18 11:39:37:168 | [INFO] |  | ASU | DeploymentManager |  |  |  | 4688 | Async thread is completed. Now exiting from function.
04/16/18 11:39:37:170 | [INFO] |  | ASU | DeploymentManager | DeploymentManager |  |  | 4796 | The install workflow is terminating.

Output Log has some corporation data that I'd rather not paste here but basically it only says:

MSI (c) (E8:78) [12:50:58:694]: Product: My-packager-product-name -- Installation operation failed.

MSI (c) (E8:78) [12:50:58:694]: Windows Installer installed the product. Product Name: My-packager-product-name. Product verisio: 1.0.0000. Product language: 1033. Producer: Adobe Systems Incorporated. Installation success or error state: 1603.

UPDATE on the issue.

Looks like the installation works if you first copy the whole package to target computer and then execute installation msi locally on that computer..

It's a workaround but It'll have to suffice before real fix is found.

Views

2.4K

Likes

Translate

Translate

Report

Report
Community Guidelines
Be kind and respectful, give credit to the original source of content, and search for duplicates before posting. Learn more

Creative Cloud Install fails with error 1603

New Here ,
Apr 16, 2018

Copy link to clipboard

Copied

I have been trying to install Creative Cloud (Package Created through Package Manager) and it stops with error 1603.

I have tried to create new different packages (both 32 and 64bit) but same error.

I've been trying to install to many different machines (W10 and W8.1) but same error occurs.

I have tried solutions on article Error 1603: A fatal error occurred during Adobe Creative Suite installation

also tried Creative Cloud Cleaning tool. We are using PDQ Deploy but I have also tried installing manually from .msi file and also from setup.exe file. Same result.

I've been trying to scroll through log files but cannot find a solution. I see a lot of ppl have this issue but no real solution is provided as far as I can tell.

Below log file pastes also, could it be that Microsoft Word is causing the issues? Though I have tried installation on machines without office also with same error:

PDApp.log

04/10/18 11:34:21:974 | [INFO] |  | ASU | DeploymentManager | DeploymentManager |  |  | 1904 | Build Version - 1.14.0.97
04/10/18 11:34:21:974 | [INFO] |  | ASU | DeploymentManager | DeploymentManager |  |  | 1904 | Logging Level verbosity Set  to 4
04/10/18 11:34:21:974 | [INFO] |  | ASU | DeploymentManager | DeploymentManager |  |  | 1904 | Executing immediate custom action for install mode.
04/10/18 11:34:21:975 | [INFO] |  | ASU | DeploymentManager | DeploymentManager |  |  | 1904 | The CustomActionData string is : mode=install;sourceDir=My-packager-product-directory;installLang=
04/10/18 11:34:21:975 | [INFO] |  | ASU | DeploymentManager | DeploymentManager |  |  | 1904 | Successfully executed the immediate custom action for install mode .
04/10/18 11:34:30:485 | [INFO] |  | ASU | DeploymentManager | DeploymentManager |  |  | 3000 | Build Version - 1.14.0.97
04/10/18 11:34:30:486 | [INFO] |  | ASU | DeploymentManager | DeploymentManager |  |  | 3000 | Logging Level verbosity Set  to 4
04/10/18 11:34:30:486 | [INFO] |  | ASU | DeploymentManager | DeploymentManager |  |  | 3000 | Executing the deferred custom action.
04/10/18 11:34:30:491 | [INFO] |  | ASU | DeploymentManager | DeploymentManager |  |  | 3000 | Obtained the following as CustomActionData
04/10/18 11:34:30:491 | [INFO] |  | ASU | DeploymentManager | DeploymentManager |  |  | 3000 | (mode=install;sourceDir=C:\windows\AdminArsenal\PDQDeployRunner\service-1\exec\;installDir=;origDB=C:\windows\My-packager-product-directory.msi;installLang=)
04/10/18 11:34:30:491 | [INFO] |  | ASU | DeploymentManager | DeploymentManager |  |  | 3000 | (mode=install;sourceDir=C:\windows\AdminArsenal\PDQDeployRunner\service-1\exec\;installDir=;origDB=C:\windows\My-packager-product-directory.msi;installLang=)
04/10/18 11:34:30:491 | [INFO] |  | ASU | DeploymentManager | DeploymentManager |  |  | 3000 | Original database path is : C:\windows\My-packager-product-directory.msi
04/10/18 11:34:30:506 | [INFO] |  | ASU | DeploymentManager | DeploymentManager |  |  | 3000 | OptionXML saved at location :: C:\Users\DEPLOY~1\AppData\Local\Temp\{805409D5-EDDB-4FE6-AF7A-E81C16FE3034}\\{5C064DDC-AA70-40A7-9D20-AFCFA9CB8496}
04/10/18 11:34:30:733 | [INFO] |  | ASU | DeploymentManager | DeploymentManager |  |  | 3000 | Build Version - 1.14.0.97
04/10/18 11:34:30:733 | [INFO] |  | ASU | DeploymentManager | DeploymentManager |  |  | 3000 | Logging Level verbosity Set  to 4
04/10/18 11:34:30:733 | [INFO] |  | ASU | DeploymentManager | DeploymentManager |  |  | 3000 | CustomAction Parameters obtained...
04/10/18 11:34:30:733 | [INFO] |  | ASU | DeploymentManager | DeploymentManager |  |  | 3000 |  optXMLPath :: C:\Users\DEPLOY~1\AppData\Local\Temp\{805409D5-EDDB-4FE6-AF7A-E81C16FE3034}\\{5C064DDC-AA70-40A7-9D20-AFCFA9CB8496}
04/10/18 11:34:30:733 | [INFO] |  | ASU | DeploymentManager | DeploymentManager |  |  | 3000 |  setupBasePath :: C:\windows\My-packager-product-directory\exec\
04/10/18 11:34:30:733 | [INFO] |  | ASU | DeploymentManager | DeploymentManager |  |  | 3000 |  installDirPath ::
04/10/18 11:34:30:733 | [INFO] |  | ASU | DeploymentManager | DeploymentManager |  |  | 3000 |  installLang ::
04/10/18 11:34:30:733 | [INFO] |  | ASU | DeploymentManager | DeploymentManager |  |  | 3000 | Initializing Custom Action Data from parameters
04/10/18 11:34:30:733 | [INFO] |  | ASU | DeploymentManager | DeploymentManager |  |  | 3000 | Provisioning Tool path is (C:\Users\DEPLOY~1\AppData\Local\Temp\{805409D5-EDDB-4FE6-AF7A-E81C16FE3034}\\{B3A8E374-3019-40D4-9805-48CE11514CBD}).
04/10/18 11:34:30:734 | [INFO] |  | ASU | DeploymentManager | DeploymentManager |  |  | 3000 | Starting to run the custom action for install mode
04/10/18 11:34:30:734 | [INFO] |  | ASU | DeploymentManager | DeploymentManager |  |  | 3000 | STEP 1: Starting to parse Option XML.
04/10/18 11:34:30:755 | [WARN] |  | ASU | DeploymentManager | DeploymentManager |  |  | 3000 | Failed to initialize from ApplicationInfo.xml (C:\windows\My-packager-product-directory\ASU\packages\ApplicationInfo.xml)...
04/10/18 11:34:30:755 | [WARN] |  | ASU | DeploymentManager | DeploymentManager |  |  | 3000 | Failed to find the latest AAM version ...
04/10/18 11:34:30:757 | [INFO] |  | ASU | DeploymentManager | DeploymentManager |  |  | 3000 | Match OS lang option selected
04/10/18 11:34:30:757 | [INFO] |  | ASU | DeploymentManager | DeploymentManager |  |  | 3000 | Added OS Language (en_US) to the install language fallback.
04/10/18 11:34:30:758 | [INFO] |  | ASU | DeploymentManager | DeploymentManager |  |  | 3000 | Install language fallback contains following languages :
04/10/18 11:34:30:758 | [INFO] |  | ASU | DeploymentManager | DeploymentManager |  |  | 3000 |     (en_US)
04/10/18 11:34:30:758 | [INFO] |  | ASU | DeploymentManager | DeploymentManager |  |  | 3000 |     (fi_FI)
04/10/18 11:34:30:758 | [INFO] |  | ASU | DeploymentManager | DeploymentManager |  |  | 3000 | Self-Update BootStrapper Relative Path doesn't exist.
04/10/18 11:34:30:758 | [INFO] |  | ASU | DeploymentManager | DeploymentManager |  |  | 3000 | Failure in getting Self-Update Folder Path.
04/10/18 11:34:30:758 | [INFO] |  | ASU | DeploymentManager | DeploymentManager |  |  | 3000 | No of updates found (0).
04/10/18 11:34:30:758 | [INFO] |  | ASU | DeploymentManager | DeploymentManager |  |  | 3000 | No of HD products found (28).
04/10/18 11:34:30:765 | [ERROR] |  | ASU | DeploymentManager | DeploymentManager |  |  | 3000 | Failed to get value for conflicting processes...
04/10/18 11:34:30:765 | [WARN] |  | ASU | DeploymentManager | DeploymentManager |  |  | 3000 | Failed to parse the conflictProcessInfo for HD media (CORE1.0)...
04/10/18 11:34:30:768 | [ERROR] |  | ASU | DeploymentManager | DeploymentManager |  |  | 3000 | Failed to get value for conflicting processes...
04/10/18 11:34:30:768 | [WARN] |  | ASU | DeploymentManager | DeploymentManager |  |  | 3000 | Failed to parse the conflictProcessInfo for HD media (COPS1.0)...
04/10/18 11:34:30:772 | [ERROR] |  | ASU | DeploymentManager | DeploymentManager |  |  | 3000 | Failed to get value for conflicting processes...
04/10/18 11:34:30:772 | [WARN] |  | ASU | DeploymentManager | DeploymentManager |  |  | 3000 | Failed to parse the conflictProcessInfo for HD media (COCM1.0)...
04/10/18 11:34:30:792 | [ERROR] |  | ASU | DeploymentManager | DeploymentManager |  |  | 3000 | Failed to get value for conflicting processes...
04/10/18 11:34:30:792 | [WARN] |  | ASU | DeploymentManager | DeploymentManager |  |  | 3000 | Failed to parse the conflictProcessInfo for HD media (CDEC1.0.0)...
04/10/18 11:34:30:821 | [ERROR] |  | ASU | DeploymentManager | DeploymentManager |  |  | 3000 | Failed to get value for conflicting processes...
04/10/18 11:34:30:821 | [WARN] |  | ASU | DeploymentManager | DeploymentManager |  |  | 3000 | Failed to parse the conflictProcessInfo for HD media (DOTN4.5.2)...
04/10/18 11:34:30:853 | [ERROR] |  | ASU | DeploymentManager | DeploymentManager |  |  | 3000 | Failed to get value for conflicting processes...
04/10/18 11:34:30:853 | [WARN] |  | ASU | DeploymentManager | DeploymentManager |  |  | 3000 | Failed to parse the conflictProcessInfo for HD media (COSY2.4.4)...
04/10/18 11:34:30:853 | [INFO] |  | ASU | DeploymentManager | DeploymentManager |  |  | 3000 | The media info tag marked for auto-install (COSY) (2.4.4)
04/10/18 11:34:30:857 | [ERROR] |  | ASU | DeploymentManager | DeploymentManager |  |  | 3000 | Failed to get value for conflicting processes...
04/10/18 11:34:30:857 | [WARN] |  | ASU | DeploymentManager | DeploymentManager |  |  | 3000 | Failed to parse the conflictProcessInfo for HD media (PSTI1.3.2)...
04/10/18 11:34:30:861 | [ERROR] |  | ASU | DeploymentManager | DeploymentManager |  |  | 3000 | Failed to get value for conflicting processes...
04/10/18 11:34:30:861 | [WARN] |  | ASU | DeploymentManager | DeploymentManager |  |  | 3000 | Failed to parse the conflictProcessInfo for HD media (COMP1.1)...
04/10/18 11:34:30:864 | [ERROR] |  | ASU | DeploymentManager | DeploymentManager |  |  | 3000 | Failed to get value for conflicting processes...
04/10/18 11:34:30:864 | [WARN] |  | ASU | DeploymentManager | DeploymentManager |  |  | 3000 | Failed to parse the conflictProcessInfo for HD media (CORG1.1)...
04/10/18 11:34:30:874 | [INFO] |  | ASU | DeploymentManager | DeploymentManager |  |  | 3000 | Custom deployment path doesnt exist in options XML
04/10/18 11:34:30:874 | [WARN] |  | ASU | DeploymentManager | DeploymentManager |  |  | 3000 | Failed to find Royalty Bearing attribute info.
04/10/18 11:34:30:874 | [INFO] |  | ASU | DeploymentManager | DeploymentManager |  |  | 3000 | Found the AppsPanel attribute info (true)
04/10/18 11:34:30:874 | [INFO] |  | ASU | DeploymentManager | DeploymentManager |  |  | 3000 | Found the AdminPrivilege attribute info (false)
04/10/18 11:34:30:874 | [INFO] |  | ASU | DeploymentManager | DeploymentManager |  |  | 3000 | Number of Medias found = 1

04/10/18 11:34:30:884 | [INFO] |  | ASU | DeploymentManager | DeploymentManager |  |  | 3000 | Deployment XML created at path :: C:\Users\DEPLOY~1\AppData\Local\Temp\{7553B765-296A-489B-94A6-D8BE5E748017}\\{ED361388-6A5A-4726-A22A-61723C4321F5}
04/10/18 11:34:30:901 | [INFO] |  | ASU | DeploymentManager | DeploymentManager |  |  | 3000 | Override XML created at path :: C:\Users\DEPLOY~1\AppData\Local\Temp\{7553B765-296A-489B-94A6-D8BE5E748017}\\{B07A332E-B0A3-4A1C-AA42-581BDB803B18}
04/10/18 11:34:30:902 | [INFO] |  | ASU | DeploymentManager | DeploymentManager |  |  | 3000 | Conflict process info retrieved (<ConflictingProcess headless="false" forceKillAllowed="false" adobeOwned="false">
<RegularExpression>^[Ww][Ii][Nn][Ww][Oo][Rr][Dd]\.[Ee][Xx][Ee]$</RegularExpression>
<ProcessDisplayName>Microsoft Word</ProcessDisplayName>
<ParentRegularExpression></ParentRegularExpression>
<ParentDisplayName></ParentDisplayName>
<RelativePath></RelativePath>
</ConflictingProcess><ConflictingProcess headless="false" forceKillAllowed="false" adobeOwned="true">
<RegularExpression>^[Aa][Cc][Rr][Oo][Bb][Aa][Tt]\.[Ee][Xx][Ee]$</RegularExpression>
<ProcessDisplayName>Adobe Acrobat 2017</ProcessDisplayName>
<ParentRegularExpression></ParentRegularExpression>
<ParentDisplayName></ParentDisplayName>
<RelativePath>[INSTALLDIR]\Acrobat 2017\Acrobat\Acrobat.exe</RelativePath>
</ConflictingProcess><ConflictingProcess headless="false" forceKillAllowed="false" adobeOwned="true">
<RegularExpression>^[Aa][Cc][Rr][Oo][Bb][Aa][Tt]\.[Ee][Xx][Ee]$</RegularExpression>
<ProcessDisplayName>
04/10/18 11:34:30:902 | [INFO] |  | ASU | DeploymentManager | DeploymentManager |  |  | 3000 | Deployment Manager is running in Install Mode.
04/10/18 11:34:30:903 | [INFO] |  | ASU | DeploymentManager | DeploymentManager |  |  | 3000 | STEP 2: Starting to launch ASU AAM.
04/10/18 11:34:30:903 | [INFO] |  | ASU | DeploymentManager | DeploymentManager |  |  | 3000 | Bootstrapper launch location is :: C:\windows\My-packager-product-directory\ASU\Set-up.dat
04/10/18 11:34:30:905 | [INFO] |  | ASU | DeploymentManager | DeploymentManager |  |  | 3000 | Build Version - 1.14.0.97
04/10/18 11:34:30:905 | [INFO] |  | ASU | DeploymentManager | DeploymentManager |  |  | 3000 | Logging Level verbosity Set  to 4
04/10/18 11:34:30:905 | [FATAL] |  | ASU | DeploymentManager | DeploymentManager |  |  | 3000 | Failed to launch the Bootstrapper process.Stopping the installation process.
04/10/18 11:34:30:906 | [ERROR] |  | ASU | DeploymentManager | DeploymentManager |  |  | 3000 | Failed to get/verify the UpdaterCore inventory base path (C:\Program Files (x86)\Common Files\Adobe\AAMUpdaterInventory\1.0\)
04/10/18 11:34:30:906 | [WARN] |  | ASU | DeploymentManager | DeploymentManager |  |  | 3000 | sendAnalytics : Unable to find deviceId.
04/10/18 11:34:30:959 | [INFO] |  | ASU | DeploymentManager | AAMEEUtilities |  |  | 3000 | The output of process received  in execWithOutput :
Microsoft Windows [Version 10.0.16299.125]

04/10/18 11:34:30:960 | [INFO] |  | ASU | DeploymentManager |  |  |  | 3000 | Event Guid generated is: '482ea179-45a3-42a3-81fc-c89b588a73cf'
04/10/18 11:34:30:975 | [INFO] |  | ASU | DeploymentManager |  |  | HTTPConnector | 3000 | GetIEProxyInfo - Failed to get proxy for the url, error:12180
04/10/18 11:34:31:628 | [INFO] |  | ASU | DeploymentManager |  |  | HTTPConnector | 3636 | HTTP Request Status code 200.
04/10/18 11:34:31:629 | [INFO] |  | ASU | DeploymentManager |  |  | HTTPConnector | 3000 | The http request returned HTTP_Status:0 HttpCommunicator error:0
04/10/18 11:34:31:632 | [INFO] |  | ASU | DeploymentManager |  |  |  | 3000 | Waiting for the async thread to get the task completed
04/10/18 11:34:31:632 | [INFO] |  | ASU | DeploymentManager |  |  |  | 3576 | Async thread is completed. Now exiting from function.
04/10/18 11:34:31:635 | [INFO] |  | ASU | DeploymentManager | DeploymentManager |  |  | 3000 | The install workflow is terminating.
04/16/18 11:28:28:764 | [INFO] |  | ASU | DeploymentManager | DeploymentManager |  |  | 1356 | Build Version - 1.14.0.97
04/16/18 11:28:28:764 | [INFO] |  | ASU | DeploymentManager | DeploymentManager |  |  | 1356 | Logging Level verbosity Set  to 4
04/16/18 11:28:28:764 | [INFO] |  | ASU | DeploymentManager | DeploymentManager |  |  | 1356 | Executing immediate custom action for install mode.
04/16/18 11:28:28:764 | [INFO] |  | ASU | DeploymentManager | DeploymentManager |  |  | 1356 | The CustomActionData string is : mode=install;sourceDir=C:\windows\My-packager-product-directory.msi;installLang=
04/16/18 11:28:28:765 | [INFO] |  | ASU | DeploymentManager | DeploymentManager |  |  | 1356 | Successfully executed the immediate custom action for install mode .
04/16/18 11:28:36:594 | [INFO] |  | ASU | DeploymentManager | DeploymentManager |  |  | 1112 | Build Version - 1.14.0.97
04/16/18 11:28:36:594 | [INFO] |  | ASU | DeploymentManager | DeploymentManager |  |  | 1112 | Logging Level verbosity Set  to 4
04/16/18 11:28:36:594 | [INFO] |  | ASU | DeploymentManager | DeploymentManager |  |  | 1112 | Executing the deferred custom action.
04/16/18 11:28:36:605 | [INFO] |  | ASU | DeploymentManager | DeploymentManager |  |  | 1112 | Obtained the following as CustomActionData
04/16/18 11:28:36:606 | [INFO] |  | ASU | DeploymentManager | DeploymentManager |  |  | 1112 | (mode=install;sourceDir=C:\windows\AdminArsenal\PDQDeployRunner\service-1\exec\;installDir=;origDB=C:\windows\My-packager-product-directory.msi;installLang=)
04/16/18 11:28:36:606 | [INFO] |  | ASU | DeploymentManager | DeploymentManager |  |  | 1112 | (mode=install;sourceDir=C:\windows\AdminArsenal\PDQDeployRunner\service-1\exec\;installDir=;origDB=C:\windows\My-packager-product-directory.msi;installLang=)
04/16/18 11:28:36:606 | [INFO] |  | ASU | DeploymentManager | DeploymentManager |  |  | 1112 | Original database path is : C:\windows\My-packager-product-directory.msi
04/16/18 11:28:36:613 | [INFO] |  | ASU | DeploymentManager | DeploymentManager |  |  | 1112 | OptionXML saved at location :: C:\Users\DEPLOY~1\AppData\Local\Temp\{9EC511FF-E200-417C-ABD2-DE592F6C2117}\\{37D744A2-AB12-49FC-9FB2-4BE05BA94D49}
04/16/18 11:28:36:631 | [INFO] |  | ASU | DeploymentManager | DeploymentManager |  |  | 1112 | Build Version - 1.14.0.97
04/16/18 11:28:36:631 | [INFO] |  | ASU | DeploymentManager | DeploymentManager |  |  | 1112 | Logging Level verbosity Set  to 4
04/16/18 11:28:36:631 | [INFO] |  | ASU | DeploymentManager | DeploymentManager |  |  | 1112 | CustomAction Parameters obtained...
04/16/18 11:28:36:631 | [INFO] |  | ASU | DeploymentManager | DeploymentManager |  |  | 1112 |  optXMLPath :: C:\Users\DEPLOY~1\AppData\Local\Temp\{9EC511FF-E200-417C-ABD2-DE592F6C2117}\\{37D744A2-AB12-49FC-9FB2-4BE05BA94D49}
04/16/18 11:28:36:632 | [INFO] |  | ASU | DeploymentManager | DeploymentManager |  |  | 1112 |  setupBasePath :: C:\windows\AdminArsenal\PDQDeployRunner\service-1\exec\
04/16/18 11:28:36:632 | [INFO] |  | ASU | DeploymentManager | DeploymentManager |  |  | 1112 |  installDirPath ::
04/16/18 11:28:36:632 | [INFO] |  | ASU | DeploymentManager | DeploymentManager |  |  | 1112 |  installLang ::
04/16/18 11:28:36:632 | [INFO] |  | ASU | DeploymentManager | DeploymentManager |  |  | 1112 | Initializing Custom Action Data from parameters
04/16/18 11:28:36:632 | [INFO] |  | ASU | DeploymentManager | DeploymentManager |  |  | 1112 | Provisioning Tool path is (C:\Users\DEPLOY~1\AppData\Local\Temp\{9EC511FF-E200-417C-ABD2-DE592F6C2117}\\{D5CC80B0-44DF-446B-8CC3-E7EA9AC53231}).
04/16/18 11:28:36:635 | [INFO] |  | ASU | DeploymentManager | DeploymentManager |  |  | 1112 | Starting to run the custom action for install mode
04/16/18 11:28:36:636 | [INFO] |  | ASU | DeploymentManager | DeploymentManager |  |  | 1112 | STEP 1: Starting to parse Option XML.
04/16/18 11:28:36:652 | [WARN] |  | ASU | DeploymentManager | DeploymentManager |  |  | 1112 | Failed to initialize from ApplicationInfo.xml (C:\windows\My-packager-product-directory\packages\ApplicationInfo.xml)...
04/16/18 11:28:36:652 | [WARN] |  | ASU | DeploymentManager | DeploymentManager |  |  | 1112 | Failed to find the latest AAM version ...
04/16/18 11:28:36:654 | [INFO] |  | ASU | DeploymentManager | DeploymentManager |  |  | 1112 | Match OS lang option selected
04/16/18 11:28:36:654 | [INFO] |  | ASU | DeploymentManager | DeploymentManager |  |  | 1112 | Added OS Language (en_US) to the install language fallback.
04/16/18 11:28:36:655 | [INFO] |  | ASU | DeploymentManager | DeploymentManager |  |  | 1112 | Install language fallback contains following languages :
04/16/18 11:28:36:655 | [INFO] |  | ASU | DeploymentManager | DeploymentManager |  |  | 1112 |     (en_US)
04/16/18 11:28:36:655 | [INFO] |  | ASU | DeploymentManager | DeploymentManager |  |  | 1112 |     (fi_FI)
04/16/18 11:28:36:655 | [INFO] |  | ASU | DeploymentManager | DeploymentManager |  |  | 1112 | Self-Update BootStrapper Relative Path doesn't exist.
04/16/18 11:28:36:655 | [INFO] |  | ASU | DeploymentManager | DeploymentManager |  |  | 1112 | Failure in getting Self-Update Folder Path.
04/16/18 11:28:36:655 | [INFO] |  | ASU | DeploymentManager | DeploymentManager |  |  | 1112 | No of updates found (0).
04/16/18 11:28:36:655 | [INFO] |  | ASU | DeploymentManager | DeploymentManager |  |  | 1112 | No of HD products found (8).
04/16/18 11:28:36:662 | [ERROR] |  | ASU | DeploymentManager | DeploymentManager |  |  | 1112 | Failed to get value for conflicting processes...
04/16/18 11:28:36:662 | [WARN] |  | ASU | DeploymentManager | DeploymentManager |  |  | 1112 | Failed to parse the conflictProcessInfo for HD media (CORE1.0)...
04/16/18 11:28:36:665 | [ERROR] |  | ASU | DeploymentManager | DeploymentManager |  |  | 1112 | Failed to get value for conflicting processes...
04/16/18 11:28:36:665 | [WARN] |  | ASU | DeploymentManager | DeploymentManager |  |  | 1112 | Failed to parse the conflictProcessInfo for HD media (COPS1.0)...
04/16/18 11:28:36:668 | [ERROR] |  | ASU | DeploymentManager | DeploymentManager |  |  | 1112 | Failed to get value for conflicting processes...
04/16/18 11:28:36:668 | [WARN] |  | ASU | DeploymentManager | DeploymentManager |  |  | 1112 | Failed to parse the conflictProcessInfo for HD media (COCM1.0)...
04/16/18 11:28:36:675 | [ERROR] |  | ASU | DeploymentManager | DeploymentManager |  |  | 1112 | Failed to get value for conflicting processes...
04/16/18 11:28:36:675 | [WARN] |  | ASU | DeploymentManager | DeploymentManager |  |  | 1112 | Failed to parse the conflictProcessInfo for HD media (CORG1.1)...
04/16/18 11:28:36:684 | [ERROR] |  | ASU | DeploymentManager | DeploymentManager |  |  | 1112 | Failed to get value for conflicting processes...
04/16/18 11:28:36:684 | [WARN] |  | ASU | DeploymentManager | DeploymentManager |  |  | 1112 | Failed to parse the conflictProcessInfo for HD media (COSY2.4.6)...
04/16/18 11:28:36:684 | [INFO] |  | ASU | DeploymentManager | DeploymentManager |  |  | 1112 | The media info tag marked for auto-install (COSY) (2.4.6)
04/16/18 11:28:36:687 | [INFO] |  | ASU | DeploymentManager | DeploymentManager |  |  | 1112 | Custom deployment path doesnt exist in options XML
04/16/18 11:28:36:687 | [WARN] |  | ASU | DeploymentManager | DeploymentManager |  |  | 1112 | Failed to find Royalty Bearing attribute info.
04/16/18 11:28:36:687 | [INFO] |  | ASU | DeploymentManager | DeploymentManager |  |  | 1112 | Found the AppsPanel attribute info (false)
04/16/18 11:28:36:687 | [INFO] |  | ASU | DeploymentManager | DeploymentManager |  |  | 1112 | Found the AdminPrivilege attribute info (false)
04/16/18 11:28:36:687 | [INFO] |  | ASU | DeploymentManager | DeploymentManager |  |  | 1112 | Number of Medias found = 1

04/16/18 11:28:36:713 | [INFO] |  | ASU | DeploymentManager | DeploymentManager |  |  | 1112 | Deployment XML created at path :: C:\Users\DEPLOY~1\AppData\Local\Temp\{81C39BF2-A3E2-458F-90F0-C6A1A29A979B}\\{154BEC3E-EC45-4672-8E41-65245116DB95}
04/16/18 11:28:36:721 | [INFO] |  | ASU | DeploymentManager | DeploymentManager |  |  | 1112 | Override XML created at path :: C:\Users\DEPLOY~1\AppData\Local\Temp\{81C39BF2-A3E2-458F-90F0-C6A1A29A979B}\\{C384C655-8B2E-4981-8662-8164FC45A822}
04/16/18 11:28:36:722 | [INFO] |  | ASU | DeploymentManager | DeploymentManager |  |  | 1112 | Conflict process info retrieved (<ConflictingProcess headless="false" forceKillAllowed="false" adobeOwned="false">
<RegularExpression>^[Ww][Ii][Nn][Ww][Oo][Rr][Dd]\.[Ee][Xx][Ee]$</RegularExpression>
<ProcessDisplayName>Microsoft Word</ProcessDisplayName>
<ParentRegularExpression></ParentRegularExpression>
<ParentDisplayName></ParentDisplayName>
<RelativePath></RelativePath>
</ConflictingProcess><ConflictingProcess headless="false" forceKillAllowed="false" adobeOwned="true">
<RegularExpression>^[Aa][Cc][Rr][Oo][Bb][Aa][Tt]\.[Ee][Xx][Ee]$</RegularExpression>
<ProcessDisplayName>Adobe Acrobat 2017</ProcessDisplayName>
<ParentRegularExpression></ParentRegularExpression>
<ParentDisplayName></ParentDisplayName>
<RelativePath>[INSTALLDIR]\Acrobat 2017\Acrobat\Acrobat.exe</RelativePath>
</ConflictingProcess><ConflictingProcess headless="false" forceKillAllowed="false" adobeOwned="true">
<RegularExpression>^[Aa][Cc][Rr][Oo][Bb][Aa][Tt]\.[Ee][Xx][Ee]$</RegularExpression>
<ProcessDisplayName>
04/16/18 11:28:36:722 | [INFO] |  | ASU | DeploymentManager | DeploymentManager |  |  | 1112 | Deployment Manager is running in Install Mode.
04/16/18 11:28:36:722 | [INFO] |  | ASU | DeploymentManager | DeploymentManager |  |  | 1112 | STEP 2: Starting to launch ASU AAM.
04/16/18 11:28:36:722 | [INFO] |  | ASU | DeploymentManager | DeploymentManager |  |  | 1112 | Bootstrapper launch location is :: C:\windows\My-packager-product-directory\ASU\Set-up.dat
04/16/18 11:28:36:723 | [INFO] |  | ASU | DeploymentManager | DeploymentManager |  |  | 1112 | Build Version - 1.14.0.97
04/16/18 11:28:36:723 | [INFO] |  | ASU | DeploymentManager | DeploymentManager |  |  | 1112 | Logging Level verbosity Set  to 4
04/16/18 11:28:36:723 | [FATAL] |  | ASU | DeploymentManager | DeploymentManager |  |  | 1112 | Failed to launch the Bootstrapper process.Stopping the installation process.
04/16/18 11:28:36:725 | [ERROR] |  | ASU | DeploymentManager | DeploymentManager |  |  | 1112 | Failed to get/verify the UpdaterCore inventory base path (C:\Program Files (x86)\Common Files\Adobe\AAMUpdaterInventory\1.0\)
04/16/18 11:28:36:725 | [WARN] |  | ASU | DeploymentManager | DeploymentManager |  |  | 1112 | sendAnalytics : Unable to find deviceId.
04/16/18 11:28:36:772 | [INFO] |  | ASU | DeploymentManager | AAMEEUtilities |  |  | 1112 | The output of process received  in execWithOutput :
Microsoft Windows [Version 10.0.16299.125]

04/16/18 11:28:36:776 | [INFO] |  | ASU | DeploymentManager |  |  |  | 1112 | Event Guid generated is: '90652ffa-71e5-4bdb-8893-cd6144deef61'
04/16/18 11:28:36:786 | [INFO] |  | ASU | DeploymentManager |  |  | HTTPConnector | 1112 | GetIEProxyInfo - Failed to get proxy for the url, error:12180
04/16/18 11:28:37:374 | [INFO] |  | ASU | DeploymentManager |  |  | HTTPConnector | 5476 | HTTP Request Status code 200.
04/16/18 11:28:37:375 | [INFO] |  | ASU | DeploymentManager |  |  | HTTPConnector | 1112 | The http request returned HTTP_Status:0 HttpCommunicator error:0
04/16/18 11:28:37:393 | [INFO] |  | ASU | DeploymentManager |  |  |  | 1112 | Waiting for the async thread to get the task completed
04/16/18 11:28:37:393 | [INFO] |  | ASU | DeploymentManager |  |  |  | 7684 | Async thread is completed. Now exiting from function.
04/16/18 11:28:37:396 | [INFO] |  | ASU | DeploymentManager | DeploymentManager |  |  | 1112 | The install workflow is terminating.
04/16/18 11:39:27:542 | [INFO] |  | ASU | DeploymentManager | DeploymentManager |  |  | 6776 | Build Version - 1.14.0.97
04/16/18 11:39:27:543 | [INFO] |  | ASU | DeploymentManager | DeploymentManager |  |  | 6776 | Logging Level verbosity Set  to 4
04/16/18 11:39:27:543 | [INFO] |  | ASU | DeploymentManager | DeploymentManager |  |  | 6776 | Executing immediate custom action for install mode.
04/16/18 11:39:27:543 | [INFO] |  | ASU | DeploymentManager | DeploymentManager |  |  | 6776 | The CustomActionData string is : mode=install;sourceDir=C:\windows\AdminArsenal\PDQDeployRunner\service-1\exec\;installDir=;origDB=C:\windows\My-packager-product-directory.msi;installLang=
04/16/18 11:39:27:543 | [INFO] |  | ASU | DeploymentManager | DeploymentManager |  |  | 6776 | Successfully executed the immediate custom action for install mode .
04/16/18 11:39:36:417 | [INFO] |  | ASU | DeploymentManager | DeploymentManager |  |  | 4796 | Build Version - 1.14.0.97
04/16/18 11:39:36:417 | [INFO] |  | ASU | DeploymentManager | DeploymentManager |  |  | 4796 | Logging Level verbosity Set  to 4
04/16/18 11:39:36:417 | [INFO] |  | ASU | DeploymentManager | DeploymentManager |  |  | 4796 | Executing the deferred custom action.
04/16/18 11:39:36:423 | [INFO] |  | ASU | DeploymentManager | DeploymentManager |  |  | 4796 | Obtained the following as CustomActionData
04/16/18 11:39:36:423 | [INFO] |  | ASU | DeploymentManager | DeploymentManager |  |  | 4796 | (mode=install;sourceDir=C:\windows\AdminArsenal\PDQDeployRunner\service-1\exec\;installDir=;origDB=C:\windows\My-packager-product-directory.msi;installLang=)
04/16/18 11:39:36:423 | [INFO] |  | ASU | DeploymentManager | DeploymentManager |  |  | 4796 | (mode=install;sourceDir=C:\windows\AdminArsenal\PDQDeployRunner\service-1\exec\;installDir=;origDB=C:\windows\My-packager-product-directory.msi;installLang=)
04/16/18 11:39:36:423 | [INFO] |  | ASU | DeploymentManager | DeploymentManager |  |  | 4796 | Original database path is : C:\windows\My-packager-product-directory.msi
04/16/18 11:39:36:430 | [INFO] |  | ASU | DeploymentManager | DeploymentManager |  |  | 4796 | OptionXML saved at location :: C:\Users\DEPLOY~1\AppData\Local\Temp\{A2047C20-3B33-432B-B194-83BF403F394E}\\{4616B0A5-D805-4AF7-92CF-830B5A081B59}
04/16/18 11:39:36:447 | [INFO] |  | ASU | DeploymentManager | DeploymentManager |  |  | 4796 | Build Version - 1.14.0.97
04/16/18 11:39:36:447 | [INFO] |  | ASU | DeploymentManager | DeploymentManager |  |  | 4796 | Logging Level verbosity Set  to 4
04/16/18 11:39:36:447 | [INFO] |  | ASU | DeploymentManager | DeploymentManager |  |  | 4796 | CustomAction Parameters obtained...
04/16/18 11:39:36:447 | [INFO] |  | ASU | DeploymentManager | DeploymentManager |  |  | 4796 |  optXMLPath :: C:\Users\DEPLOY~1\AppData\Local\Temp\{A2047C20-3B33-432B-B194-83BF403F394E}\\{4616B0A5-D805-4AF7-92CF-830B5A081B59}
04/16/18 11:39:36:447 | [INFO] |  | ASU | DeploymentManager | DeploymentManager |  |  | 4796 |  setupBasePath :: C:\windows\AdminArsenal\PDQDeployRunner\service-1\exec\
04/16/18 11:39:36:447 | [INFO] |  | ASU | DeploymentManager | DeploymentManager |  |  | 4796 |  installDirPath ::
04/16/18 11:39:36:447 | [INFO] |  | ASU | DeploymentManager | DeploymentManager |  |  | 4796 |  installLang ::
04/16/18 11:39:36:447 | [INFO] |  | ASU | DeploymentManager | DeploymentManager |  |  | 4796 | Initializing Custom Action Data from parameters
04/16/18 11:39:36:447 | [INFO] |  | ASU | DeploymentManager | DeploymentManager |  |  | 4796 | Provisioning Tool path is (C:\Users\DEPLOY~1\AppData\Local\Temp\{A2047C20-3B33-432B-B194-83BF403F394E}\\{46052B71-8569-408D-ACFA-1571E03F5C91}).
04/16/18 11:39:36:451 | [INFO] |  | ASU | DeploymentManager | DeploymentManager |  |  | 4796 | Starting to run the custom action for install mode
04/16/18 11:39:36:451 | [INFO] |  | ASU | DeploymentManager | DeploymentManager |  |  | 4796 | STEP 1: Starting to parse Option XML.
04/16/18 11:39:36:455 | [WARN] |  | ASU | DeploymentManager | DeploymentManager |  |  | 4796 | Failed to initialize from ApplicationInfo.xml (C:\windowsMy-packager-product-directory\ASU\packages\ApplicationInfo.xml)...
04/16/18 11:39:36:456 | [WARN] |  | ASU | DeploymentManager | DeploymentManager |  |  | 4796 | Failed to find the latest AAM version ...
04/16/18 11:39:36:456 | [INFO] |  | ASU | DeploymentManager | DeploymentManager |  |  | 4796 | Match OS lang option selected
04/16/18 11:39:36:456 | [INFO] |  | ASU | DeploymentManager | DeploymentManager |  |  | 4796 | Added OS Language (en_US) to the install language fallback.
04/16/18 11:39:36:456 | [INFO] |  | ASU | DeploymentManager | DeploymentManager |  |  | 4796 | Install language fallback contains following languages :
04/16/18 11:39:36:456 | [INFO] |  | ASU | DeploymentManager | DeploymentManager |  |  | 4796 |     (en_US)
04/16/18 11:39:36:456 | [INFO] |  | ASU | DeploymentManager | DeploymentManager |  |  | 4796 |     (fi_FI)
04/16/18 11:39:36:456 | [INFO] |  | ASU | DeploymentManager | DeploymentManager |  |  | 4796 | Self-Update BootStrapper Relative Path doesn't exist.
04/16/18 11:39:36:456 | [INFO] |  | ASU | DeploymentManager | DeploymentManager |  |  | 4796 | Failure in getting Self-Update Folder Path.
04/16/18 11:39:36:456 | [INFO] |  | ASU | DeploymentManager | DeploymentManager |  |  | 4796 | No of updates found (0).
04/16/18 11:39:36:456 | [INFO] |  | ASU | DeploymentManager | DeploymentManager |  |  | 4796 | No of HD products found (8).
04/16/18 11:39:36:460 | [ERROR] |  | ASU | DeploymentManager | DeploymentManager |  |  | 4796 | Failed to get value for conflicting processes...
04/16/18 11:39:36:460 | [WARN] |  | ASU | DeploymentManager | DeploymentManager |  |  | 4796 | Failed to parse the conflictProcessInfo for HD media (CORE1.0)...
04/16/18 11:39:36:463 | [ERROR] |  | ASU | DeploymentManager | DeploymentManager |  |  | 4796 | Failed to get value for conflicting processes...
04/16/18 11:39:36:463 | [WARN] |  | ASU | DeploymentManager | DeploymentManager |  |  | 4796 | Failed to parse the conflictProcessInfo for HD media (COPS1.0)...
04/16/18 11:39:36:466 | [ERROR] |  | ASU | DeploymentManager | DeploymentManager |  |  | 4796 | Failed to get value for conflicting processes...
04/16/18 11:39:36:466 | [WARN] |  | ASU | DeploymentManager | DeploymentManager |  |  | 4796 | Failed to parse the conflictProcessInfo for HD media (COCM1.0)...
04/16/18 11:39:36:473 | [ERROR] |  | ASU | DeploymentManager | DeploymentManager |  |  | 4796 | Failed to get value for conflicting processes...
04/16/18 11:39:36:474 | [WARN] |  | ASU | DeploymentManager | DeploymentManager |  |  | 4796 | Failed to parse the conflictProcessInfo for HD media (CORG1.1)...
04/16/18 11:39:36:482 | [ERROR] |  | ASU | DeploymentManager | DeploymentManager |  |  | 4796 | Failed to get value for conflicting processes...
04/16/18 11:39:36:482 | [WARN] |  | ASU | DeploymentManager | DeploymentManager |  |  | 4796 | Failed to parse the conflictProcessInfo for HD media (COSY2.4.6)...
04/16/18 11:39:36:482 | [INFO] |  | ASU | DeploymentManager | DeploymentManager |  |  | 4796 | The media info tag marked for auto-install (COSY) (2.4.6)
04/16/18 11:39:36:485 | [INFO] |  | ASU | DeploymentManager | DeploymentManager |  |  | 4796 | Custom deployment path doesnt exist in options XML
04/16/18 11:39:36:485 | [WARN] |  | ASU | DeploymentManager | DeploymentManager |  |  | 4796 | Failed to find Royalty Bearing attribute info.
04/16/18 11:39:36:485 | [INFO] |  | ASU | DeploymentManager | DeploymentManager |  |  | 4796 | Found the AppsPanel attribute info (false)
04/16/18 11:39:36:485 | [INFO] |  | ASU | DeploymentManager | DeploymentManager |  |  | 4796 | Found the AdminPrivilege attribute info (false)
04/16/18 11:39:36:485 | [INFO] |  | ASU | DeploymentManager | DeploymentManager |  |  | 4796 | Number of Medias found = 1

04/16/18 11:39:36:513 | [INFO] |  | ASU | DeploymentManager | DeploymentManager |  |  | 4796 | Deployment XML created at path :: C:\Users\DEPLOY~1\AppData\Local\Temp\{D198725F-ABB3-4DCD-9388-35B3F474686F}\\{A382FD88-16DC-420C-A715-36C3074F947A}
04/16/18 11:39:36:521 | [INFO] |  | ASU | DeploymentManager | DeploymentManager |  |  | 4796 | Override XML created at path :: C:\Users\DEPLOY~1\AppData\Local\Temp\{D198725F-ABB3-4DCD-9388-35B3F474686F}\\{4EF73C27-1C9C-46F9-99ED-D2D683F3B1E7}
04/16/18 11:39:36:523 | [INFO] |  | ASU | DeploymentManager | DeploymentManager |  |  | 4796 | Conflict process info retrieved (<ConflictingProcess headless="false" forceKillAllowed="false" adobeOwned="false">
<RegularExpression>^[Ww][Ii][Nn][Ww][Oo][Rr][Dd]\.[Ee][Xx][Ee]$</RegularExpression>
<ProcessDisplayName>Microsoft Word</ProcessDisplayName>
<ParentRegularExpression></ParentRegularExpression>
<ParentDisplayName></ParentDisplayName>
<RelativePath></RelativePath>
</ConflictingProcess><ConflictingProcess headless="false" forceKillAllowed="false" adobeOwned="true">
<RegularExpression>^[Aa][Cc][Rr][Oo][Bb][Aa][Tt]\.[Ee][Xx][Ee]$</RegularExpression>
<ProcessDisplayName>Adobe Acrobat 2017</ProcessDisplayName>
<ParentRegularExpression></ParentRegularExpression>
<ParentDisplayName></ParentDisplayName>
<RelativePath>[INSTALLDIR]\Acrobat 2017\Acrobat\Acrobat.exe</RelativePath>
</ConflictingProcess><ConflictingProcess headless="false" forceKillAllowed="false" adobeOwned="true">
<RegularExpression>^[Aa][Cc][Rr][Oo][Bb][Aa][Tt]\.[Ee][Xx][Ee]$</RegularExpression>
<ProcessDisplayName>
04/16/18 11:39:36:523 | [INFO] |  | ASU | DeploymentManager | DeploymentManager |  |  | 4796 | Deployment Manager is running in Install Mode.
04/16/18 11:39:36:524 | [INFO] |  | ASU | DeploymentManager | DeploymentManager |  |  | 4796 | STEP 2: Starting to launch ASU AAM.
04/16/18 11:39:36:524 | [INFO] |  | ASU | DeploymentManager | DeploymentManager |  |  | 4796 | Bootstrapper launch location is :: C:\windows\AdminArsenal\PDQDeployRunner\service-1\exec\ASU\Set-up.dat
04/16/18 11:39:36:526 | [INFO] |  | ASU | DeploymentManager | DeploymentManager |  |  | 4796 | Build Version - 1.14.0.97
04/16/18 11:39:36:527 | [INFO] |  | ASU | DeploymentManager | DeploymentManager |  |  | 4796 | Logging Level verbosity Set  to 4
04/16/18 11:39:36:527 | [FATAL] |  | ASU | DeploymentManager | DeploymentManager |  |  | 4796 | Failed to launch the Bootstrapper process.Stopping the installation process.
04/16/18 11:39:36:529 | [ERROR] |  | ASU | DeploymentManager | DeploymentManager |  |  | 4796 | Failed to get/verify the UpdaterCore inventory base path (C:\Program Files (x86)\Common Files\Adobe\AAMUpdaterInventory\1.0\)
04/16/18 11:39:36:529 | [WARN] |  | ASU | DeploymentManager | DeploymentManager |  |  | 4796 | sendAnalytics : Unable to find deviceId.
04/16/18 11:39:36:609 | [INFO] |  | ASU | DeploymentManager | AAMEEUtilities |  |  | 4796 | The output of process received  in execWithOutput :
Microsoft Windows [Version 10.0.16299.125]

04/16/18 11:39:36:612 | [INFO] |  | ASU | DeploymentManager |  |  |  | 4796 | Event Guid generated is: '01d76335-5d8b-493f-be80-337f321662a3'
04/16/18 11:39:36:625 | [INFO] |  | ASU | DeploymentManager |  |  | HTTPConnector | 4796 | GetIEProxyInfo - Failed to get proxy for the url, error:12180
04/16/18 11:39:37:166 | [INFO] |  | ASU | DeploymentManager |  |  | HTTPConnector | 2316 | HTTP Request Status code 200.
04/16/18 11:39:37:166 | [INFO] |  | ASU | DeploymentManager |  |  | HTTPConnector | 4796 | The http request returned HTTP_Status:0 HttpCommunicator error:0
04/16/18 11:39:37:168 | [INFO] |  | ASU | DeploymentManager |  |  |  | 4796 | Waiting for the async thread to get the task completed
04/16/18 11:39:37:168 | [INFO] |  | ASU | DeploymentManager |  |  |  | 4688 | Async thread is completed. Now exiting from function.
04/16/18 11:39:37:170 | [INFO] |  | ASU | DeploymentManager | DeploymentManager |  |  | 4796 | The install workflow is terminating.

Output Log has some corporation data that I'd rather not paste here but basically it only says:

MSI (c) (E8:78) [12:50:58:694]: Product: My-packager-product-name -- Installation operation failed.

MSI (c) (E8:78) [12:50:58:694]: Windows Installer installed the product. Product Name: My-packager-product-name. Product verisio: 1.0.0000. Product language: 1033. Producer: Adobe Systems Incorporated. Installation success or error state: 1603.

UPDATE on the issue.

Looks like the installation works if you first copy the whole package to target computer and then execute installation msi locally on that computer..

It's a workaround but It'll have to suffice before real fix is found.

Views

2.4K

Likes

Translate

Translate

Report

Report
Community Guidelines
Be kind and respectful, give credit to the original source of content, and search for duplicates before posting. Learn more
New Here ,
Apr 16, 2018

Copy link to clipboard

Copied

I Have Same Proplem

Likes

Translate

Translate

Report

Report
Community Guidelines
Be kind and respectful, give credit to the original source of content, and search for duplicates before posting. Learn more
Reply
Loading...
New Here ,
Apr 16, 2018

Copy link to clipboard

Copied

UPDATE on the issue.

Looks like the installation works if you first copy the whole package to target computer and then execute installation msi locally on that computer..

It's a workaround but It'll have to suffice before real fix is found.

Likes

Translate

Translate

Report

Report
Community Guidelines
Be kind and respectful, give credit to the original source of content, and search for duplicates before posting. Learn more
Reply
Loading...
_jluong_ LATEST
New Here ,
Oct 24, 2019

Copy link to clipboard

Copied

I was using PDQ to deploy Creative Cloud - all apps and had the same problem. Looking at the main installer log file did help. Windows: \Program Files (x86)\Common Files\Adobe\Installers 

 

I had a fatal error code of 505 which this website https://helpx.adobe.com/creative-cloud/kb/troubleshoot-download-install-logs.html said to re-run in Local System context in PDQ. Works like a charm!

Likes

Translate

Translate

Report

Report
Community Guidelines
Be kind and respectful, give credit to the original source of content, and search for duplicates before posting. Learn more
Reply
Loading...