Highlighted

Error While installing Captivate from MSI

Community Beginner ,
Jun 14, 2017

Copy link to clipboard

Copied

I successfully created the packages for all products and added them to SCCM, all tested fine except Captivate, I tried installing it locally and it failed both the msi and the exe.

CustomAction CADeploy returned actual error code 1603 (note this may not be 100% accurate if translation happened inside sandbox)

Action ended 13:00:23: InstallFinalize. Return value 3.

Action ended 13:00:23: INSTALL. Return value 3.

Action ended 13:00:23: INSTALL. Return value 3.

=== Logging stopped: 15/06/2017  13:00:23 ===

MSI (c) (C8:A4) [13:00:23:641]: Product: Adobe Captivate 2017 -- Installation operation failed.

MSI (c) (C8:A4) [13:00:23:642]: Windows Installer installed the product. Product Name: Adobe Captivate 2017. Product Version: 1.0.0000. Product Language: 1033. Manufacturer: Adobe Systems Incorporated. Installation success or error status: 1603.

Thank you for the log files. Now this gives me an error 7 which means a critical component has failed to install.

To look into which critical component in particular is failing, I would need the contents of another log file for Captivate.log.gz located at

C:\Program Files (x86)\Common Files\Adobe\Installers

(.gz is a compressed file format and this would need to be extracted first using any utility)

0189014280

Views

1.8K

Likes

Translate

Translate

Report

Report
Community Guidelines
Be kind and respectful, give credit to the original source of content, and search for duplicates before posting. Learn more

Error While installing Captivate from MSI

Community Beginner ,
Jun 14, 2017

Copy link to clipboard

Copied

I successfully created the packages for all products and added them to SCCM, all tested fine except Captivate, I tried installing it locally and it failed both the msi and the exe.

CustomAction CADeploy returned actual error code 1603 (note this may not be 100% accurate if translation happened inside sandbox)

Action ended 13:00:23: InstallFinalize. Return value 3.

Action ended 13:00:23: INSTALL. Return value 3.

Action ended 13:00:23: INSTALL. Return value 3.

=== Logging stopped: 15/06/2017  13:00:23 ===

MSI (c) (C8:A4) [13:00:23:641]: Product: Adobe Captivate 2017 -- Installation operation failed.

MSI (c) (C8:A4) [13:00:23:642]: Windows Installer installed the product. Product Name: Adobe Captivate 2017. Product Version: 1.0.0000. Product Language: 1033. Manufacturer: Adobe Systems Incorporated. Installation success or error status: 1603.

Thank you for the log files. Now this gives me an error 7 which means a critical component has failed to install.

To look into which critical component in particular is failing, I would need the contents of another log file for Captivate.log.gz located at

C:\Program Files (x86)\Common Files\Adobe\Installers

(.gz is a compressed file format and this would need to be extracted first using any utility)

0189014280

Views

1.8K

Likes

Translate

Translate

Report

Report
Community Guidelines
Be kind and respectful, give credit to the original source of content, and search for duplicates before posting. Learn more
Jun 14, 2017 0
Most Valuable Participant ,
Jun 14, 2017

Copy link to clipboard

Copied

Some information and Packager Links https://forums.adobe.com/thread/1586021

Likes

Translate

Translate

Report

Report
Community Guidelines
Be kind and respectful, give credit to the original source of content, and search for duplicates before posting. Learn more
Reply
Loading...
Jun 14, 2017 0
Adobe Employee ,
Jun 15, 2017

Copy link to clipboard

Copied

Hi There,

Error 1603 on Windows is quite a generic error and simply means that an error has occurred and doesn't give us the exact cause of the error. Could you please check the PDAPP.log file under %temp% on one of the affected machines for an error code which would give us more details about the exact reason for this installation failure.

If you are not able to locate an error on that, please paste the content of this file from the last installation attempt so we can take a look at what may have caused this failure.

Likes

Translate

Translate

Report

Report
Community Guidelines
Be kind and respectful, give credit to the original source of content, and search for duplicates before posting. Learn more
Reply
Loading...
Jun 15, 2017 0
Community Beginner ,
Jun 15, 2017

Copy link to clipboard

Copied

Hi ankusing, find below the log file output for a fresh install.

06/16/17 11:36:48:827 | [INFO] |  | ASU | MSIInvoker | MSIInvoker |  |  | 11380 | Build Version - 1.12.0.27

06/16/17 11:36:48:827 | [INFO] |  | ASU | MSIInvoker | MSIInvoker |  |  | 11380 | Logging Level verbosity Set  to 4

06/16/17 11:36:48:861 | [INFO] |  | ASU | MSIInvoker | MSIInvoker |  |  | 11380 | Successfully fetched the optionXML content from MSI database ...

06/16/17 11:36:50:764 | [INFO] |  | ASU | DeploymentManager | DeploymentManager |  |  | 1320 | Build Version - 1.12.0.27

06/16/17 11:36:50:764 | [INFO] |  | ASU | DeploymentManager | DeploymentManager |  |  | 1320 | Logging Level verbosity Set  to 4

06/16/17 11:36:50:764 | [INFO] |  | ASU | DeploymentManager | DeploymentManager |  |  | 1320 | Executing immediate custom action for install mode.

06/16/17 11:36:50:764 | [INFO] |  | ASU | DeploymentManager | DeploymentManager |  |  | 1320 | The CustomActionData string is : mode=install;sourceDir=C:\WINDOWS\ccmcache\j\;installDir=;origDB=C:\WINDOWS\ccmcache\j\Adobe Captivate 2017.msi;installLang=

06/16/17 11:36:50:764 | [INFO] |  | ASU | DeploymentManager | DeploymentManager |  |  | 1320 | Successfully executed the immediate custom action for install mode .

06/16/17 11:36:56:179 | [INFO] |  | ASU | DeploymentManager | DeploymentManager |  |  | 5572 | Build Version - 1.12.0.27

06/16/17 11:36:56:179 | [INFO] |  | ASU | DeploymentManager | DeploymentManager |  |  | 5572 | Logging Level verbosity Set  to 4

06/16/17 11:36:56:179 | [INFO] |  | ASU | DeploymentManager | DeploymentManager |  |  | 5572 | Executing the deferred custom action.

06/16/17 11:36:56:183 | [INFO] |  | ASU | DeploymentManager | DeploymentManager |  |  | 5572 | Obtained the following as CustomActionData

06/16/17 11:36:56:183 | [INFO] |  | ASU | DeploymentManager | DeploymentManager |  |  | 5572 | (mode=install;sourceDir=C:\WINDOWS\ccmcache\j\;installDir=;origDB=C:\WINDOWS\ccmcache\j\Adobe Captivate 2017.msi;installLang=)

06/16/17 11:36:56:183 | [INFO] |  | ASU | DeploymentManager | DeploymentManager |  |  | 5572 | (mode=install;sourceDir=C:\WINDOWS\ccmcache\j\;installDir=;origDB=C:\WINDOWS\ccmcache\j\Adobe Captivate 2017.msi;installLang=)

06/16/17 11:36:56:183 | [INFO] |  | ASU | DeploymentManager | DeploymentManager |  |  | 5572 | Original database path is : C:\WINDOWS\ccmcache\j\Adobe Captivate 2017.msi

06/16/17 11:36:56:191 | [INFO] |  | ASU | DeploymentManager | DeploymentManager |  |  | 5572 | OptionXML saved at location :: C:\Users\boulos\AppData\Local\Temp\{61E7AE47-BE55-4C82-9342-16D951BEEF1F}\\{CBCB837D-3C9E-4CE7-9066-E3C3E0843B52}

06/16/17 11:36:56:206 | [INFO] |  | ASU | DeploymentManager | DeploymentManager |  |  | 5572 | Build Version - 1.12.0.27

06/16/17 11:36:56:206 | [INFO] |  | ASU | DeploymentManager | DeploymentManager |  |  | 5572 | Logging Level verbosity Set  to 4

06/16/17 11:36:56:206 | [INFO] |  | ASU | DeploymentManager | DeploymentManager |  |  | 5572 | CustomAction Parameters obtained...

06/16/17 11:36:56:206 | [INFO] |  | ASU | DeploymentManager | DeploymentManager |  |  | 5572 |  optXMLPath :: C:\Users\boulos\AppData\Local\Temp\{61E7AE47-BE55-4C82-9342-16D951BEEF1F}\\{CBCB837D-3C9E-4CE7-9066-E3C3E0843B52}

06/16/17 11:36:56:206 | [INFO] |  | ASU | DeploymentManager | DeploymentManager |  |  | 5572 |  setupBasePath :: C:\WINDOWS\ccmcache\j\

06/16/17 11:36:56:206 | [INFO] |  | ASU | DeploymentManager | DeploymentManager |  |  | 5572 |  installDirPath ::

06/16/17 11:36:56:206 | [INFO] |  | ASU | DeploymentManager | DeploymentManager |  |  | 5572 |  installLang ::

06/16/17 11:36:56:206 | [INFO] |  | ASU | DeploymentManager | DeploymentManager |  |  | 5572 | Initializing Custom Action Data from parameters

06/16/17 11:36:56:207 | [INFO] |  | ASU | DeploymentManager | DeploymentManager |  |  | 5572 | Provisioning Tool path is (C:\Users\boulos\AppData\Local\Temp\{61E7AE47-BE55-4C82-9342-16D951BEEF1F}\\{0A12ED65-D0AD-4165-A4E2-F5F3831CE4A6}).

06/16/17 11:36:56:208 | [INFO] |  | ASU | DeploymentManager | DeploymentManager |  |  | 5572 | Starting to run the custom action for install mode

06/16/17 11:36:56:208 | [INFO] |  | ASU | DeploymentManager | DeploymentManager |  |  | 5572 | STEP 1: Starting to parse Option XML.

06/16/17 11:36:56:214 | [INFO] |  | ASU | DeploymentManager | DeploymentManager |  |  | 5572 | Latest AAM version with the package is (4.0.1.188)...

06/16/17 11:36:56:214 | [INFO] |  | ASU | DeploymentManager | DeploymentManager |  |  | 5572 | Install language fallback contains following languages :

06/16/17 11:36:56:214 | [INFO] |  | ASU | DeploymentManager | DeploymentManager |  |  | 5572 |     (en_GB)

06/16/17 11:36:56:214 | [INFO] |  | ASU | DeploymentManager | DeploymentManager |  |  | 5572 | Self-Update BootStrapper Relative Path doesn't exist.

06/16/17 11:36:56:215 | [INFO] |  | ASU | DeploymentManager | DeploymentManager |  |  | 5572 | No of updates found (1).

06/16/17 11:36:56:215 | [INFO] |  | ASU | DeploymentManager | DeploymentManager |  |  | 5572 | No of HD products found (0).

06/16/17 11:36:56:215 | [INFO] |  | ASU | DeploymentManager | DeploymentManager |  |  | 5572 | Custom deployment path doesnt exist in options XML

06/16/17 11:36:56:262 | [INFO] |  | ASU | DeploymentManager | DeploymentManager |  |  | 5572 | Found the AppsPanel attribute info (false)

06/16/17 11:36:56:263 | [INFO] |  | ASU | DeploymentManager | DeploymentManager |  |  | 5572 | Found the AdminPrivilege attribute info (false)

06/16/17 11:36:56:263 | [INFO] |  | ASU | DeploymentManager | DeploymentManager |  |  | 5572 | Number of Medias found = 1

06/16/17 11:36:56:270 | [INFO] |  | ASU | DeploymentManager | DeploymentManager |  |  | 5572 | Deployment XML created at path :: C:\Users\boulos\AppData\Local\Temp\{AE261E27-75D6-4209-BB5E-7F3C60260EFD}\\{5DC3779E-EF98-4750-A4EF-CBC0A7EDC79F}

06/16/17 11:36:56:284 | [INFO] |  | ASU | DeploymentManager | DeploymentManager |  |  | 5572 | Override XML created at path :: C:\Users\boulos\AppData\Local\Temp\{AE261E27-75D6-4209-BB5E-7F3C60260EFD}\\{7D8B479F-42A0-416F-B8B4-877CD6B4CCA5}

06/16/17 11:36:56:286 | [ERROR] |  | ASU | DeploymentManager | DeploymentManager |  |  | 5572 | Failed to get value for conflicting processes...

06/16/17 11:36:56:286 | [ERROR] |  | ASU | DeploymentManager | DeploymentManager |  |  | 5572 | Failed to retrieve the conflict process info.

06/16/17 11:36:56:286 | [INFO] |  | ASU | DeploymentManager | DeploymentManager |  |  | 5572 | Deployment Manager is running in Install Mode.

06/16/17 11:36:56:286 | [INFO] |  | ASU | DeploymentManager | DeploymentManager |  |  | 5572 | STEP 2: Starting to launch ASU AAM.

06/16/17 11:36:56:286 | [INFO] |  | ASU | DeploymentManager | DeploymentManager |  |  | 5572 | Bootstrapper launch location is :: C:\WINDOWS\ccmcache\j\ASU\Set-up.dat

06/16/17 11:36:56:416 | [INFO] |  | ASU | OPM | OPM |  |  | 5528 | Build Version - 10.0.0.99

06/16/17 11:36:56:416 | [INFO] |  | ASU | OPM | OPM |  |  | 5528 | Logging Level verbosity Set  to 4

06/16/17 11:36:56:427 | [INFO] |  | ASU | OPM | OPM |  |  | 5528 | Schema version and schema compatibility version are same or greater than current

06/16/17 11:36:56:503 | [INFO] |  | ASU | OPM | OPM |  |  | 5528 | _opm_handle_OPDReturnedStatus called with opdStatus as:0

06/16/17 11:36:56:504 | [INFO] |  | ASU | OPM | OPM |  |  | 5528 | No Record found for the input fields in opm_getValueForKey

06/16/17 11:36:58:345 | [INFO] |  | ASU | DeploymentManager | DeploymentManager |  |  | 5572 | Build Version - 1.12.0.27

06/16/17 11:36:58:345 | [INFO] |  | ASU | DeploymentManager | DeploymentManager |  |  | 5572 | Logging Level verbosity Set  to 4

06/16/17 11:36:58:345 | [INFO] |  | ASU | DeploymentManager | DeploymentManager |  |  | 5572 | The return code from the Bootstrapper Process is (0).

06/16/17 11:36:58:351 | [INFO] |  | ASU | DeploymentManager | DeploymentManager |  |  | 5572 | Created file with ACC Panel Masked C:\Program Files (x86)\Common Files\Adobe\OOBE\Configs\ServiceConfig.xml

06/16/17 11:36:58:352 | [INFO] |  | ASU | DeploymentManager | DeploymentManager |  |  | 5572 | Starting apply CCP ASU.

06/16/17 11:36:58:352 | [INFO] |  | ASU | DeploymentManager | DeploymentManager |  |  | 5572 | Bootstrapper launch location is :: C:\WINDOWS\ccmcache\j\ASU2\Set-up.dat

06/16/17 11:36:58:445 | [INFO] |  | ASU | Setup | Setup |  |  | 3092 | Build Version - 10.0.0.49

06/16/17 11:36:58:445 | [INFO] |  | ASU | Setup | Setup |  |  | 3092 | Logging Level verbosity Set  to 4

06/16/17 11:36:58:448 | [INFO] |  | ASU | Setup |  |  |  | 3092 | Event Guid generated is: '30421553-907e-43ed-b186-de5ed6845656'

06/16/17 11:36:58:448 | [INFO] |  | ASU | Setup | Setup |  |  | 3092 | Start Adobe Setup

06/16/17 11:36:58:449 | [INFO] |  | ASU | Setup | Setup |  |  | 3092 | TimeLog: Bootstrapper Start

06/16/17 11:36:58:449 | [INFO] |  | ASU | Setup | Setup |  |  | 3092 | TimeLog: Start initial checks

06/16/17 11:36:58:449 | [INFO] |  | ASU | Setup | Setup |  |  | 3092 | Action specified - "install"

06/16/17 11:36:58:449 | [INFO] |  | ASU | Setup | PIM |  |  | 3092 | XML is valid

06/16/17 11:36:58:450 | [WARN] |  | ASU | Setup | PIM |  |  | 3092 | Failed to find Node

06/16/17 11:36:58:450 | [WARN] |  | ASU | Setup | Setup |  |  | 3092 | Reboot is pending from earlier installation.

06/16/17 11:36:58:451 | [INFO] |  | ASU | Setup | Utilities |  |  | 3092 | Semaphore is not locked

06/16/17 11:36:58:452 | [INFO] |  | ASU | PIM | PIM |  |  | 3092 | Build Version - 10.0.0.132

06/16/17 11:36:58:452 | [INFO] |  | ASU | PIM | PIM |  |  | 3092 | Logging Level verbosity Set  to 4

06/16/17 11:36:58:452 | [INFO] |  | ASU | PIM | PIM |  |  | 3092 | Build Version - 10.0.0.132

06/16/17 11:36:58:452 | [INFO] |  | ASU | PIM | PIM |  |  | 3092 | Logging Level verbosity Set  to 4

06/16/17 11:36:58:452 | [INFO] |  | ASU | PIM | PIM |  |  | 3092 | CREATE PIM Instance ...

06/16/17 11:36:58:453 | [INFO] |  | ASU | PIM | PIM |  |  | 3092 | trying to createOrUpdatePIMDbSchema.

06/16/17 11:36:58:454 | [INFO] |  | ASU | PIM | PIM |  |  | 3092 | Current db schema version on machine 1.

06/16/17 11:36:58:454 | [INFO] |  | ASU | PIM | PIM |  |  | 3092 | Current db schema version to install 1.

06/16/17 11:36:58:454 | [INFO] |  | ASU | PIM | PIM |  |  | 3092 | PIM DB Schema is up to date. Current schema version is 1.

06/16/17 11:36:58:454 | [INFO] |  | ASU | PIM | PIM |  |  | 3092 | PIM Database is Up To Date.

06/16/17 11:36:58:454 | [INFO] |  | ASU | PIM | PIM |  |  | 3092 | Updater Inventory location:C:\WINDOWS\ccmcache\j\ASU2\resources\updaterinventory.dll

06/16/17 11:36:58:455 | [INFO] |  | ASU | PIM | PIM |  |  | 3092 | Acquired System level ACF lock ...

06/16/17 11:36:58:455 | [INFO] |  | ASU | Setup | Setup |  |  | 3092 | TimeLog: End initial checks

06/16/17 11:36:58:455 | [INFO] |  | ASU | Setup | Setup |  |  | 3092 | TimeLog: Begin Installing

06/16/17 11:36:58:456 | [INFO] |  | ASU | PIM | PIM |  |  | 3092 | Current OS version is: Major:10, Minor:0, ServicePack:0

06/16/17 11:36:58:460 | [INFO] |  | ASU | PIM | PIM |  |  | 3092 | XML is valid

06/16/17 11:36:58:461 | [WARN] |  | ASU | PIM | PIM |  |  | 3092 | Failed to find Node

06/16/17 11:36:58:462 | [INFO] |  | ASU | PIM | PIM |  |  | 3092 | Package id 2D07B44E-5043-413A-BF8F-127DDB5B61EC is already installed

06/16/17 11:36:58:464 | [INFO] |  | ASU | Setup |  |  |  | 11024 | Event with guid '30421553-907e-43ed-b186-de5ed6845656' is being sent

06/16/17 11:36:58:471 | [INFO] |  | ASU | Setup |  |  | HTTPConnector | 11024 | GetIEProxyInfo - Failed to get proxy for the url, error:12180

06/16/17 11:36:58:471 | [INFO] |  | ASU | PIM | PIM |  |  | 3092 | XML is valid

06/16/17 11:36:58:472 | [WARN] |  | ASU | PIM | PIM |  |  | 3092 | Failed to find Node

06/16/17 11:36:58:473 | [INFO] |  | ASU | PIM | PIM |  |  | 3092 | Package id 1B3D24F6-3654-4EB4-A783-101CD2162E7C is already installed

06/16/17 11:36:58:480 | [INFO] |  | ASU | PIM | PIM |  |  | 3092 | XML is valid

06/16/17 11:36:58:481 | [WARN] |  | ASU | PIM | PIM |  |  | 3092 | Failed to find Node

06/16/17 11:36:58:481 | [INFO] |  | ASU | PIM | PIM |  |  | 3092 | Package id FB270CC2-4272-4706-890F-2829237CBB06 is already installed

06/16/17 11:36:58:485 | [INFO] |  | ASU | PIM | PIM |  |  | 3092 | XML is valid

06/16/17 11:36:58:485 | [WARN] |  | ASU | PIM | PIM |  |  | 3092 | Failed to find Node

06/16/17 11:36:58:485 | [INFO] |  | ASU | PIM | PIM |  |  | 3092 | Package id E1991EA9-E359-43BA-9DBE-F2657FFAABF4 is already installed

06/16/17 11:36:58:489 | [INFO] |  | ASU | PIM | PIM |  |  | 3092 | XML is valid

06/16/17 11:36:58:490 | [WARN] |  | ASU | PIM | PIM |  |  | 3092 | Failed to find Node

06/16/17 11:36:58:490 | [INFO] |  | ASU | PIM | PIM |  |  | 3092 | Package id CE50F807-977B-4BC7-8ABD-CAD97273A9EC is a Old Package, a newer package is installed in the system.

06/16/17 11:36:58:491 | [INFO] |  | ASU | PIM | PIM |  |  | 3092 | XML is valid

06/16/17 11:36:58:491 | [WARN] |  | ASU | PIM | PIM |  |  | 3092 | Failed to find Node

06/16/17 11:36:58:492 | [INFO] |  | ASU | PIM | PIM |  |  | 3092 | Package id 71796FCB-CA48-4BD1-9D93-D51093659A17 is already installed

06/16/17 11:36:58:502 | [INFO] |  | ASU | PIM | PIM |  |  | 3092 | XML is valid

06/16/17 11:36:58:503 | [WARN] |  | ASU | PIM | PIM |  |  | 3092 | Failed to find Node

06/16/17 11:36:58:504 | [INFO] |  | ASU | PIM | PIM |  |  | 3092 | Package id 399F5D01-3BF2-4310-A624-3B5DB12FAA13 is already installed

06/16/17 11:36:58:510 | [INFO] |  | ASU | PIM | PIM |  |  | 3092 | XML is valid

06/16/17 11:36:58:510 | [WARN] |  | ASU | PIM | PIM |  |  | 3092 | Failed to find Node

06/16/17 11:36:58:511 | [INFO] |  | ASU | PIM | PIM |  |  | 3092 | Package id C3CA168F-F93A-434E-8C2C-EB2211744463 is a Old Package, a newer package is installed in the system.

06/16/17 11:36:58:512 | [INFO] |  | ASU | PIM | PIM |  |  | 3092 | XML is valid

06/16/17 11:36:58:513 | [WARN] |  | ASU | PIM | PIM |  |  | 3092 | Failed to find Node

06/16/17 11:36:58:513 | [INFO] |  | ASU | PIM | PIM |  |  | 3092 | Package id A3B57320-15AD-4AF5-897D-6C9D7C6B7353 is already installed

06/16/17 11:36:58:516 | [INFO] |  | ASU | PIM | PIM |  |  | 3092 | XML is valid

06/16/17 11:36:58:517 | [WARN] |  | ASU | PIM | PIM |  |  | 3092 | Failed to find Node

06/16/17 11:36:58:518 | [INFO] |  | ASU | PIM | PIM |  |  | 3092 | Package id BFA7D133-643F-42A1-B243-CAF6C7C4B696 is already installed

06/16/17 11:36:58:525 | [INFO] |  | ASU | PIM | PIM |  |  | 3092 | XML is valid

06/16/17 11:36:58:525 | [WARN] |  | ASU | PIM | PIM |  |  | 3092 | Failed to find Node

06/16/17 11:36:58:526 | [INFO] |  | ASU | PIM | PIM |  |  | 3092 | Package id 21693786-66E8-4A21-A57B-8085FF9ACD07 is already installed

06/16/17 11:36:58:526 | [INFO] |  | ASU | PIM | PIM |  |  | 3092 | pim_haveEnoughDiskSpaceToInstallPackages reqSize ... 40409899

06/16/17 11:36:58:526 | [INFO] |  | ASU | PIM | PIM |  |  | 3092 | Executing Adobe Genuine Validation for all the AAM packages

06/16/17 11:36:58:526 | [INFO] |  | ASU | PIM | PIM |  |  | 3092 | Validating package file: 'C:\WINDOWS\ccmcache\j\ASU2\packages\core\PDApp.pimx'

06/16/17 11:36:58:528 | [INFO] |  | ASU | PIM | PIM |  |  | 3092 | Validating package file: 'C:\WINDOWS\ccmcache\j\ASU2\packages\core\PDApp.pima'

06/16/17 11:36:58:529 | [INFO] |  | ASU | PIM | PIM |  |  | 3092 | Validating package file: 'C:\WINDOWS\ccmcache\j\ASU2\packages\D6\D6.pimx'

06/16/17 11:36:58:530 | [INFO] |  | ASU | PIM | PIM |  |  | 3092 | Validating package file: 'C:\WINDOWS\ccmcache\j\ASU2\packages\D6\D6.pima'

06/16/17 11:36:58:531 | [INFO] |  | ASU | PIM | PIM |  |  | 3092 | Validating package file: 'C:\WINDOWS\ccmcache\j\ASU2\packages\DECore\DECore.pimx'

06/16/17 11:36:58:532 | [INFO] |  | ASU | PIM | PIM |  |  | 3092 | Validating package file: 'C:\WINDOWS\ccmcache\j\ASU2\packages\DECore\DECore.pima'

06/16/17 11:36:58:533 | [INFO] |  | ASU | PIM | PIM |  |  | 3092 | Validating package file: 'C:\WINDOWS\ccmcache\j\ASU2\packages\DWA\DWA.pimx'

06/16/17 11:36:58:534 | [INFO] |  | ASU | PIM | PIM |  |  | 3092 | Validating package file: 'C:\WINDOWS\ccmcache\j\ASU2\packages\DWA\DWA.pima'

06/16/17 11:36:58:535 | [INFO] |  | ASU | PIM | PIM |  |  | 3092 | Validating package file: 'C:\WINDOWS\ccmcache\j\ASU2\packages\P6\P6.pimx'

06/16/17 11:36:58:536 | [INFO] |  | ASU | PIM | PIM |  |  | 3092 | Validating package file: 'C:\WINDOWS\ccmcache\j\ASU2\packages\P6\P6.pima'

06/16/17 11:36:58:538 | [INFO] |  | ASU | PIM | PIM |  |  | 3092 | Validating package file: 'C:\WINDOWS\ccmcache\j\ASU2\packages\LWA\LWA.pimx'

06/16/17 11:36:58:538 | [INFO] |  | ASU | PIM | PIM |  |  | 3092 | Validating package file: 'C:\WINDOWS\ccmcache\j\ASU2\packages\LWA\LWA.pima'

06/16/17 11:36:58:540 | [INFO] |  | ASU | PIM | PIM |  |  | 3092 | Validating package file: 'C:\WINDOWS\ccmcache\j\ASU2\packages\UWA\UWA.pimx'

06/16/17 11:36:58:541 | [INFO] |  | ASU | PIM | PIM |  |  | 3092 | Validating package file: 'C:\WINDOWS\ccmcache\j\ASU2\packages\UWA\UWA.pima'

06/16/17 11:36:58:543 | [INFO] |  | ASU | PIM | PIM |  |  | 3092 | Validating package file: 'C:\WINDOWS\ccmcache\j\ASU2\packages\CCM\CCM.pimx'

06/16/17 11:36:58:544 | [INFO] |  | ASU | PIM | PIM |  |  | 3092 | Validating package file: 'C:\WINDOWS\ccmcache\j\ASU2\packages\CCM\CCM.pima'

06/16/17 11:36:58:546 | [INFO] |  | ASU | PIM | PIM |  |  | 3092 | Validating package file: 'C:\WINDOWS\ccmcache\j\ASU2\packages\IPC\IPC.pimx'

06/16/17 11:36:58:546 | [INFO] |  | ASU | PIM | PIM |  |  | 3092 | Validating package file: 'C:\WINDOWS\ccmcache\j\ASU2\packages\IPC\IPC.pima'

06/16/17 11:36:58:547 | [INFO] |  | ASU | PIM | PIM |  |  | 3092 | Validating package file: 'C:\WINDOWS\ccmcache\j\ASU2\packages\P7\P7.pimx'

06/16/17 11:36:58:548 | [INFO] |  | ASU | PIM | PIM |  |  | 3092 | Validating package file: 'C:\WINDOWS\ccmcache\j\ASU2\packages\P7\P7.pima'

06/16/17 11:36:58:549 | [INFO] |  | ASU | PIM | PIM |  |  | 3092 | Validating package file: 'C:\WINDOWS\ccmcache\j\ASU2\packages\AdobeGCClient\AdobeGCClient.pimx'

06/16/17 11:36:58:550 | [INFO] |  | ASU | PIM | PIM |  |  | 3092 | Validating package file: 'C:\WINDOWS\ccmcache\j\ASU2\packages\AdobeGCClient\AdobeGCClient.pima'

06/16/17 11:36:58:551 | [INFO] |  | ASU | PIM | PIM |  |  | 3092 | Adobe Genuine Validation PASSED for all the AAM packages

06/16/17 11:36:58:551 | [INFO] |  | ASU | PIM | PIM |  |  | 3092 | START installPackage at file C:\WINDOWS\ccmcache\j\ASU2\packages\core\PDApp.pimx

06/16/17 11:36:58:556 | [INFO] |  | ASU | PIM | PIM |  |  | 3092 | XML is valid

06/16/17 11:36:58:556 | [WARN] |  | ASU | PIM | PIM |  |  | 3092 | Failed to find Node

06/16/17 11:36:58:558 | [INFO] |  | ASU | PIM | PIM |  |  | 3092 | Package id 2D07B44E-5043-413A-BF8F-127DDB5B61EC is already installed

06/16/17 11:36:58:574 | [INFO] |  | ASU | PIM | PIM |  |  | 3092 | SUCCESS deleteAppletRegInfoRecords.

06/16/17 11:36:58:607 | [INFO] |  | ASU | PIM | PIM |  |  | 3092 | SUCCESS deletePackageUpgradeInfoRecords.

06/16/17 11:36:58:607 | [INFO] |  | ASU | PIM | PIM |  |  | 3092 | SUCCESS deletePackageInstallationInfoRecords.

06/16/17 11:36:58:893 | [INFO] |  | ASU | PIM | PIM |  |  | 3092 | SUCCESS insertPackageUpdateList.

06/16/17 11:36:58:894 | [WARN] |  | ASU | PIM | PIM |  |  | 3092 | Failed to find Node

06/16/17 11:36:58:894 | [INFO] |  | ASU | PIM | PIM |  |  | 3092 | SUCCESS insertAppletRegInfoList.

06/16/17 11:36:58:902 | [INFO] |  | ASU | PIM | PIM |  |  | 3092 | Backup Folder Created

06/16/17 11:36:59:280 | [INFO] |  | ASU | PIM | Utilities |  |  | 3092 | Directory not present

06/16/17 11:36:59:280 | [INFO] |  | ASU | PIM | PIM |  |  | 3092 | ERROR Failed Delete backed up assets

06/16/17 11:36:59:280 | [INFO] |  | ASU | PIM | PIM |  |  | 3092 | Trying to delete back up folder 'C:\Program Files (x86)\Common Files\Adobe\OOBE\PDApp\core_bkp1'

06/16/17 11:36:59:380 | [INFO] |  | ASU | PIM | Utilities |  |  | 3092 | Path to Process :C:\Program Files (x86)\Common Files\Adobe\OOBE\PDApp\\core\AAMCustomHook.exe Process Directory :C:\Program Files (x86)\Common Files\Adobe\OOBE\PDApp\\core arguments being passed :"C:\Program Files (x86)\Common Files\Adobe\OOBE\PDApp\\core\AAMCustomHook.exe" --createInventory=1 --doPostInstallStep=1

06/16/17 11:36:59:407 | [INFO] |  | ASU | PIM | Utilities |  |  | 3092 | Success in CreateProcess

06/16/17 11:36:59:434 | [INFO] |  | ASU | AAMCustomHook | AAMCustomHook |  |  | 9248 | Build Version - 10.0.0.49

06/16/17 11:36:59:434 | [INFO] |  | ASU | AAMCustomHook | AAMCustomHook |  |  | 9248 | Logging Level verbosity Set  to 4

06/16/17 11:36:59:434 | [INFO] |  | ASU | AAMCustomHook |  |  | CommandLineParser | 9248 | Parsing the command line provided. Number of command line arguments is 3

06/16/17 11:36:59:448 | [INFO] |  | ASU | AAMCustomHook | AAMCustomHook |  |  | 9248 | Updater Inventory location: 'C:\Program Files (x86)\Common Files\Adobe\OOBE\PDApp\\UWA\updaterinventory.dll'

06/16/17 11:36:59:449 | [INFO] |  | ASU | AAMCustomHook | AAMCustomHook |  |  | 9248 | Going to create or update inventory

06/16/17 11:36:59:458 | [INFO] |  | ASU | AAMCustomHook | AAMCustomHook |  |  | 9248 | Inventory Already present on the machine...

06/16/17 11:36:59:462 | [INFO] |  | ASU | PIM | Utilities |  |  | 3092 | Sucessfully launched and executed process...

06/16/17 11:36:59:462 | [INFO] |  | ASU | PIM | PIM |  |  | 3092 | Successfully executed install modifier at path: 'C:\Program Files (x86)\Common Files\Adobe\OOBE\PDApp\\core\AAMCustomHook.exe'

06/16/17 11:36:59:463 | [INFO] |  | ASU | PIM | PIM |  |  | 3092 | SUCCESS installPackage at file C:\WINDOWS\ccmcache\j\ASU2\packages\core\PDApp.pimx.

06/16/17 11:36:59:477 | [INFO] |  | ASU | PIM | PIM |  |  | 3092 | START installPackage at file C:\WINDOWS\ccmcache\j\ASU2\packages\D6\D6.pimx

06/16/17 11:36:59:479 | [INFO] |  | ASU | PIM | PIM |  |  | 3092 | XML is valid

06/16/17 11:36:59:480 | [WARN] |  | ASU | PIM | PIM |  |  | 3092 | Failed to find Node

06/16/17 11:36:59:481 | [INFO] |  | ASU | PIM | PIM |  |  | 3092 | Package id 1B3D24F6-3654-4EB4-A783-101CD2162E7C is already installed

06/16/17 11:36:59:496 | [INFO] |  | ASU | PIM | PIM |  |  | 3092 | SUCCESS deleteAppletRegInfoRecords.

06/16/17 11:36:59:515 | [INFO] |  | ASU | PIM | PIM |  |  | 3092 | SUCCESS deletePackageUpgradeInfoRecords.

06/16/17 11:36:59:515 | [INFO] |  | ASU | PIM | PIM |  |  | 3092 | SUCCESS deletePackageInstallationInfoRecords.

06/16/17 11:36:59:616 | [INFO] |  | ASU | PIM | PIM |  |  | 3092 | SUCCESS insertPackageUpdateList.

06/16/17 11:36:59:617 | [INFO] |  | ASU | PIM | PIM |  |  | 3092 | SUCCESS insertAppletRegInfoList.

06/16/17 11:36:59:651 | [INFO] |  | ASU | PIM | PIM |  |  | 3092 | Backup Folder Created

06/16/17 11:36:59:869 | [INFO] |  | ASU | PIM | Utilities |  |  | 3092 | Directory not present

06/16/17 11:36:59:870 | [INFO] |  | ASU | PIM | PIM |  |  | 3092 | ERROR Failed Delete backed up assets

06/16/17 11:36:59:870 | [INFO] |  | ASU | PIM | PIM |  |  | 3092 | Trying to delete back up folder 'C:\Program Files (x86)\Common Files\Adobe\OOBE\PDApp\D6_bkp1'

06/16/17 11:36:59:988 | [INFO] |  | ASU | PIM | PIM |  |  | 3092 | SUCCESS installPackage at file C:\WINDOWS\ccmcache\j\ASU2\packages\D6\D6.pimx.

06/16/17 11:37:00:001 | [INFO] |  | ASU | PIM | PIM |  |  | 3092 | START installPackage at file C:\WINDOWS\ccmcache\j\ASU2\packages\DECore\DECore.pimx

06/16/17 11:37:00:006 | [INFO] |  | ASU | PIM | PIM |  |  | 3092 | XML is valid

06/16/17 11:37:00:006 | [WARN] |  | ASU | PIM | PIM |  |  | 3092 | Failed to find Node

06/16/17 11:37:00:008 | [INFO] |  | ASU | PIM | PIM |  |  | 3092 | Package id FB270CC2-4272-4706-890F-2829237CBB06 is already installed

06/16/17 11:37:00:021 | [INFO] |  | ASU | PIM | PIM |  |  | 3092 | SUCCESS deleteAppletRegInfoRecords.

06/16/17 11:37:00:040 | [INFO] |  | ASU | PIM | PIM |  |  | 3092 | SUCCESS deletePackageUpgradeInfoRecords.

06/16/17 11:37:00:040 | [INFO] |  | ASU | PIM | PIM |  |  | 3092 | SUCCESS deletePackageInstallationInfoRecords.

06/16/17 11:37:00:134 | [INFO] |  | ASU | PIM | PIM |  |  | 3092 | SUCCESS insertPackageUpdateList.

06/16/17 11:37:00:134 | [WARN] |  | ASU | PIM | PIM |  |  | 3092 | Failed to find Node

06/16/17 11:37:00:134 | [INFO] |  | ASU | PIM | PIM |  |  | 3092 | SUCCESS insertAppletRegInfoList.

06/16/17 11:37:00:142 | [INFO] |  | ASU | PIM | PIM |  |  | 3092 | Backup Folder Created

06/16/17 11:37:00:284 | [INFO] |  | ASU | Setup |  |  | HTTPConnector | 6828 | HTTP Request Status code 200.

06/16/17 11:37:00:284 | [INFO] |  | ASU | Setup |  |  | HTTPConnector | 11024 | The http request returned HTTP_Status:0 HttpCommunicator error:0

06/16/17 11:37:00:525 | [INFO] |  | ASU | PIM | Utilities |  |  | 3092 | Directory not present

06/16/17 11:37:00:525 | [INFO] |  | ASU | PIM | PIM |  |  | 3092 | ERROR Failed Delete backed up assets

06/16/17 11:37:00:525 | [INFO] |  | ASU | PIM | PIM |  |  | 3092 | Trying to delete back up folder 'C:\Program Files (x86)\Common Files\Adobe\OOBE\PDApp\DECore_bkp1'

06/16/17 11:37:00:592 | [INFO] |  | ASU | PIM | PIM |  |  | 3092 | SUCCESS installPackage at file C:\WINDOWS\ccmcache\j\ASU2\packages\DECore\DECore.pimx.

06/16/17 11:37:00:604 | [INFO] |  | ASU | PIM | PIM |  |  | 3092 | START installPackage at file C:\WINDOWS\ccmcache\j\ASU2\packages\DWA\DWA.pimx

06/16/17 11:37:00:606 | [INFO] |  | ASU | PIM | PIM |  |  | 3092 | XML is valid

06/16/17 11:37:00:606 | [WARN] |  | ASU | PIM | PIM |  |  | 3092 | Failed to find Node

06/16/17 11:37:00:607 | [INFO] |  | ASU | PIM | PIM |  |  | 3092 | Package id E1991EA9-E359-43BA-9DBE-F2657FFAABF4 is already installed

06/16/17 11:37:00:621 | [INFO] |  | ASU | PIM | PIM |  |  | 3092 | SUCCESS deleteAppletRegInfoRecords.

06/16/17 11:37:00:630 | [INFO] |  | ASU | PIM | PIM |  |  | 3092 | SUCCESS deletePackageUpgradeInfoRecords.

06/16/17 11:37:00:630 | [INFO] |  | ASU | PIM | PIM |  |  | 3092 | SUCCESS deletePackageInstallationInfoRecords.

06/16/17 11:37:00:656 | [INFO] |  | ASU | PIM | PIM |  |  | 3092 | SUCCESS insertPackageUpdateList.

06/16/17 11:37:00:656 | [INFO] |  | ASU | PIM | PIM |  |  | 3092 | SUCCESS insertAppletRegInfoList.

06/16/17 11:37:00:658 | [INFO] |  | ASU | PIM | PIM |  |  | 3092 | Backup Folder Created

06/16/17 11:37:00:684 | [WARN] |  | ASU | PIM | PIM |  |  | 3092 | Failed to find Node

06/16/17 11:37:00:753 | [INFO] |  | ASU | PIM | Utilities |  |  | 3092 | Directory not present

06/16/17 11:37:00:753 | [INFO] |  | ASU | PIM | PIM |  |  | 3092 | ERROR Failed Delete backed up assets

06/16/17 11:37:00:753 | [INFO] |  | ASU | PIM | PIM |  |  | 3092 | Trying to delete back up folder 'C:\Program Files (x86)\Common Files\Adobe\OOBE\PDApp\DWA_bkp1'

06/16/17 11:37:00:813 | [INFO] |  | ASU | PIM | PIM |  |  | 3092 | SUCCESS installPackage at file C:\WINDOWS\ccmcache\j\ASU2\packages\DWA\DWA.pimx.

06/16/17 11:37:00:826 | [INFO] |  | ASU | PIM | PIM |  |  | 3092 | START installPackage at file C:\WINDOWS\ccmcache\j\ASU2\packages\P6\P6.pimx

06/16/17 11:37:00:829 | [INFO] |  | ASU | PIM | PIM |  |  | 3092 | XML is valid

06/16/17 11:37:00:829 | [WARN] |  | ASU | PIM | PIM |  |  | 3092 | Failed to find Node

06/16/17 11:37:00:830 | [INFO] |  | ASU | PIM | PIM |  |  | 3092 | NOTE package id CE50F807-977B-4BC7-8ABD-CAD97273A9EC is a Old Package, a newer package is installed in the system.

06/16/17 11:37:00:830 | [INFO] |  | ASU | PIM | PIM |  |  | 3092 | START installPackage at file C:\WINDOWS\ccmcache\j\ASU2\packages\LWA\LWA.pimx

06/16/17 11:37:00:832 | [INFO] |  | ASU | PIM | PIM |  |  | 3092 | XML is valid

06/16/17 11:37:00:832 | [WARN] |  | ASU | PIM | PIM |  |  | 3092 | Failed to find Node

06/16/17 11:37:00:833 | [INFO] |  | ASU | PIM | PIM |  |  | 3092 | Package id 71796FCB-CA48-4BD1-9D93-D51093659A17 is already installed

06/16/17 11:37:00:848 | [INFO] |  | ASU | PIM | PIM |  |  | 3092 | SUCCESS deleteAppletRegInfoRecords.

06/16/17 11:37:00:861 | [INFO] |  | ASU | PIM | PIM |  |  | 3092 | SUCCESS deletePackageUpgradeInfoRecords.

06/16/17 11:37:00:861 | [INFO] |  | ASU | PIM | PIM |  |  | 3092 | SUCCESS deletePackageInstallationInfoRecords.

06/16/17 11:37:00:886 | [INFO] |  | ASU | PIM | PIM |  |  | 3092 | SUCCESS insertPackageUpdateList.

06/16/17 11:37:00:887 | [INFO] |  | ASU | PIM | PIM |  |  | 3092 | SUCCESS insertAppletRegInfoList.

06/16/17 11:37:00:889 | [INFO] |  | ASU | PIM | PIM |  |  | 3092 | Backup Folder Created

06/16/17 11:37:00:915 | [WARN] |  | ASU | PIM | PIM |  |  | 3092 | Failed to find Node

06/16/17 11:37:01:404 | [INFO] |  | ASU | PIM | Utilities |  |  | 3092 | Directory not present

06/16/17 11:37:01:404 | [INFO] |  | ASU | PIM | PIM |  |  | 3092 | ERROR Failed Delete backed up assets

06/16/17 11:37:01:404 | [INFO] |  | ASU | PIM | PIM |  |  | 3092 | Trying to delete back up folder 'C:\Program Files (x86)\Common Files\Adobe\OOBE\PDApp\LWA_bkp1'

06/16/17 11:37:01:601 | [INFO] |  | ASU | PIM | PIM |  |  | 3092 | SUCCESS installPackage at file C:\WINDOWS\ccmcache\j\ASU2\packages\LWA\LWA.pimx.

06/16/17 11:37:01:613 | [INFO] |  | ASU | PIM | PIM |  |  | 3092 | START installPackage at file C:\WINDOWS\ccmcache\j\ASU2\packages\UWA\UWA.pimx

06/16/17 11:37:01:619 | [INFO] |  | ASU | PIM | PIM |  |  | 3092 | XML is valid

06/16/17 11:37:01:619 | [WARN] |  | ASU | PIM | PIM |  |  | 3092 | Failed to find Node

06/16/17 11:37:01:622 | [INFO] |  | ASU | PIM | PIM |  |  | 3092 | Package id 399F5D01-3BF2-4310-A624-3B5DB12FAA13 is already installed

06/16/17 11:37:01:637 | [INFO] |  | ASU | PIM | PIM |  |  | 3092 | SUCCESS deleteAppletRegInfoRecords.

06/16/17 11:37:01:662 | [INFO] |  | ASU | PIM | PIM |  |  | 3092 | SUCCESS deletePackageUpgradeInfoRecords.

06/16/17 11:37:01:662 | [INFO] |  | ASU | PIM | PIM |  |  | 3092 | SUCCESS deletePackageInstallationInfoRecords.

06/16/17 11:37:01:816 | [INFO] |  | ASU | PIM | PIM |  |  | 3092 | SUCCESS insertPackageUpdateList.

06/16/17 11:37:01:817 | [INFO] |  | ASU | PIM | PIM |  |  | 3092 | SUCCESS insertAppletRegInfoList.

06/16/17 11:37:01:825 | [INFO] |  | ASU | PIM | PIM |  |  | 3092 | Backup Folder Created

06/16/17 11:37:02:046 | [INFO] |  | ASU | PIM | Utilities |  |  | 3092 | Directory not present

06/16/17 11:37:02:046 | [INFO] |  | ASU | PIM | PIM |  |  | 3092 | ERROR Failed Delete backed up assets

06/16/17 11:37:02:046 | [INFO] |  | ASU | PIM | PIM |  |  | 3092 | Trying to delete back up folder 'C:\Program Files (x86)\Common Files\Adobe\OOBE\PDApp\UWA_bkp1'

06/16/17 11:37:02:134 | [INFO] |  | ASU | PIM | PIM |  |  | 3092 | SUCCESS installPackage at file C:\WINDOWS\ccmcache\j\ASU2\packages\UWA\UWA.pimx.

06/16/17 11:37:02:148 | [INFO] |  | ASU | PIM | PIM |  |  | 3092 | START installPackage at file C:\WINDOWS\ccmcache\j\ASU2\packages\CCM\CCM.pimx

06/16/17 11:37:02:151 | [INFO] |  | ASU | PIM | PIM |  |  | 3092 | XML is valid

06/16/17 11:37:02:151 | [WARN] |  | ASU | PIM | PIM |  |  | 3092 | Failed to find Node

06/16/17 11:37:02:152 | [INFO] |  | ASU | PIM | PIM |  |  | 3092 | NOTE package id C3CA168F-F93A-434E-8C2C-EB2211744463 is a Old Package, a newer package is installed in the system.

06/16/17 11:37:02:153 | [INFO] |  | ASU | PIM | PIM |  |  | 3092 | START installPackage at file C:\WINDOWS\ccmcache\j\ASU2\packages\IPC\IPC.pimx

06/16/17 11:37:02:155 | [INFO] |  | ASU | PIM | PIM |  |  | 3092 | XML is valid

06/16/17 11:37:02:155 | [WARN] |  | ASU | PIM | PIM |  |  | 3092 | Failed to find Node

06/16/17 11:37:02:156 | [INFO] |  | ASU | PIM | PIM |  |  | 3092 | Package id A3B57320-15AD-4AF5-897D-6C9D7C6B7353 is already installed

06/16/17 11:37:02:170 | [INFO] |  | ASU | PIM | PIM |  |  | 3092 | SUCCESS deleteAppletRegInfoRecords.

06/16/17 11:37:02:187 | [INFO] |  | ASU | PIM | PIM |  |  | 3092 | SUCCESS deletePackageUpgradeInfoRecords.

06/16/17 11:37:02:187 | [INFO] |  | ASU | PIM | PIM |  |  | 3092 | SUCCESS deletePackageInstallationInfoRecords.

06/16/17 11:37:02:221 | [INFO] |  | ASU | PIM | PIM |  |  | 3092 | SUCCESS insertPackageUpdateList.

06/16/17 11:37:02:221 | [WARN] |  | ASU | PIM | PIM |  |  | 3092 | Failed to find Node

06/16/17 11:37:02:221 | [INFO] |  | ASU | PIM | PIM |  |  | 3092 | SUCCESS insertAppletRegInfoList.

06/16/17 11:37:02:222 | [INFO] |  | ASU | PIM | PIM |  |  | 3092 | Backup Folder Created

06/16/17 11:37:02:277 | [INFO] |  | ASU | PIM | Utilities |  |  | 3092 | Directory not present

06/16/17 11:37:02:278 | [INFO] |  | ASU | PIM | PIM |  |  | 3092 | ERROR Failed Delete backed up assets

06/16/17 11:37:02:278 | [INFO] |  | ASU | PIM | PIM |  |  | 3092 | Trying to delete back up folder 'C:\Program Files (x86)\Common Files\Adobe\OOBE\PDApp\IPC_bkp1'

06/16/17 11:37:02:334 | [INFO] |  | ASU | PIM | Utilities |  |  | 3092 | Path to Process :C:\Program Files (x86)\Common Files\Adobe\OOBE\PDApp\\IPC\customhook\AdobeIPCBrokerCustomHook.exe Process Directory :C:\Program Files (x86)\Common Files\Adobe\OOBE\PDApp\\IPC\customhook arguments being passed :"C:\Program Files (x86)\Common Files\Adobe\OOBE\PDApp\\IPC\customhook\AdobeIPCBrokerCustomHook.exe" -uninstall

06/16/17 11:37:02:371 | [INFO] |  | ASU | PIM | Utilities |  |  | 3092 | Success in CreateProcess

06/16/17 11:37:02:594 | [INFO] |  | ASU | PIM | Utilities |  |  | 3092 | Sucessfully launched and executed process...

06/16/17 11:37:02:594 | [INFO] |  | ASU | PIM | PIM |  |  | 3092 | Successfully executed install modifier at path: 'C:\Program Files (x86)\Common Files\Adobe\OOBE\PDApp\\IPC\customhook\AdobeIPCBrokerCustomHook.exe'

06/16/17 11:37:02:595 | [INFO] |  | ASU | PIM | PIM |  |  | 3092 | SUCCESS installPackage at file C:\WINDOWS\ccmcache\j\ASU2\packages\IPC\IPC.pimx.

06/16/17 11:37:02:610 | [INFO] |  | ASU | PIM | PIM |  |  | 3092 | START installPackage at file C:\WINDOWS\ccmcache\j\ASU2\packages\P7\P7.pimx

06/16/17 11:37:02:616 | [INFO] |  | ASU | PIM | PIM |  |  | 3092 | XML is valid

06/16/17 11:37:02:617 | [WARN] |  | ASU | PIM | PIM |  |  | 3092 | Failed to find Node

06/16/17 11:37:02:620 | [INFO] |  | ASU | PIM | PIM |  |  | 3092 | Package id BFA7D133-643F-42A1-B243-CAF6C7C4B696 is already installed

06/16/17 11:37:02:635 | [INFO] |  | ASU | PIM | PIM |  |  | 3092 | SUCCESS deleteAppletRegInfoRecords.

06/16/17 11:37:02:652 | [INFO] |  | ASU | PIM | PIM |  |  | 3092 | SUCCESS deletePackageUpgradeInfoRecords.

06/16/17 11:37:02:652 | [INFO] |  | ASU | PIM | PIM |  |  | 3092 | SUCCESS deletePackageInstallationInfoRecords.

06/16/17 11:37:02:746 | [INFO] |  | ASU | PIM | PIM |  |  | 3092 | SUCCESS insertPackageUpdateList.

06/16/17 11:37:02:747 | [INFO] |  | ASU | PIM | PIM |  |  | 3092 | SUCCESS insertAppletRegInfoList.

06/16/17 11:37:02:755 | [INFO] |  | ASU | PIM | PIM |  |  | 3092 | Backup Folder Created

06/16/17 11:37:03:207 | [INFO] |  | ASU | PIM | Utilities |  |  | 3092 | Directory not present

06/16/17 11:37:03:207 | [INFO] |  | ASU | PIM | PIM |  |  | 3092 | ERROR Failed Delete backed up assets

06/16/17 11:37:03:207 | [INFO] |  | ASU | PIM | PIM |  |  | 3092 | Trying to delete back up folder 'C:\Program Files (x86)\Common Files\Adobe\OOBE\PDApp\P7_bkp1'

06/16/17 11:37:03:336 | [INFO] |  | ASU | PIM | PIM |  |  | 3092 | SUCCESS installPackage at file C:\WINDOWS\ccmcache\j\ASU2\packages\P7\P7.pimx.

06/16/17 11:37:03:349 | [INFO] |  | ASU | PIM | PIM |  |  | 3092 | START installPackage at file C:\WINDOWS\ccmcache\j\ASU2\packages\AdobeGCClient\AdobeGCClient.pimx

06/16/17 11:37:03:350 | [INFO] |  | ASU | PIM | PIM |  |  | 3092 | XML is valid

06/16/17 11:37:03:350 | [WARN] |  | ASU | PIM | PIM |  |  | 3092 | Failed to find Node

06/16/17 11:37:03:350 | [INFO] |  | ASU | PIM | PIM |  |  | 3092 | Package id 21693786-66E8-4A21-A57B-8085FF9ACD07 is already installed

06/16/17 11:37:03:362 | [INFO] |  | ASU | PIM | PIM |  |  | 3092 | SUCCESS deleteAppletRegInfoRecords.

06/16/17 11:37:03:369 | [INFO] |  | ASU | PIM | PIM |  |  | 3092 | SUCCESS deletePackageUpgradeInfoRecords.

06/16/17 11:37:03:369 | [INFO] |  | ASU | PIM | PIM |  |  | 3092 | SUCCESS deletePackageInstallationInfoRecords.

06/16/17 11:37:03:380 | [INFO] |  | ASU | PIM | PIM |  |  | 3092 | SUCCESS insertPackageUpdateList.

06/16/17 11:37:03:380 | [WARN] |  | ASU | PIM | PIM |  |  | 3092 | Failed to find Node

06/16/17 11:37:03:380 | [INFO] |  | ASU | PIM | PIM |  |  | 3092 | SUCCESS insertAppletRegInfoList.

06/16/17 11:37:03:382 | [INFO] |  | ASU | PIM | PIM |  |  | 3092 | Backup Folder Created

06/16/17 11:37:03:533 | [INFO] |  | ASU | PIM | Utilities |  |  | 3092 | Directory not present

06/16/17 11:37:03:533 | [INFO] |  | ASU | PIM | PIM |  |  | 3092 | ERROR Failed Delete backed up assets

06/16/17 11:37:03:533 | [INFO] |  | ASU | PIM | PIM |  |  | 3092 | Trying to delete back up folder 'C:\Program Files (x86)\Common Files\Adobe\OOBE\PDApp\AdobeGCClient_bkp1'

06/16/17 11:37:03:573 | [INFO] |  | ASU | PIM | Utilities |  |  | 3092 | Path to Process :C:\Program Files (x86)\Common Files\Adobe\OOBE\PDApp\\AdobeGCClient\customhook/gccustomhook.exe Process Directory :C:\Program Files (x86)\Common Files\Adobe\OOBE\PDApp\\AdobeGCClient arguments being passed :"C:\Program Files (x86)\Common Files\Adobe\OOBE\PDApp\\AdobeGCClient\customhook/gccustomhook.exe"

06/16/17 11:37:03:629 | [INFO] |  | ASU | PIM | Utilities |  |  | 3092 | Success in CreateProcess

06/16/17 11:37:03:861 | [INFO] |  | ASU | PIM | Utilities |  |  | 3092 | Sucessfully launched and executed process...

06/16/17 11:37:03:862 | [INFO] |  | ASU | PIM | PIM |  |  | 3092 | Successfully executed install modifier at path: 'C:\Program Files (x86)\Common Files\Adobe\OOBE\PDApp\\AdobeGCClient\customhook/gccustomhook.exe'

06/16/17 11:37:03:862 | [INFO] |  | ASU | PIM | PIM |  |  | 3092 | SUCCESS installPackage at file C:\WINDOWS\ccmcache\j\ASU2\packages\AdobeGCClient\AdobeGCClient.pimx.

06/16/17 11:37:03:968 | [INFO] |  | ASU | PIM | PIM |  |  | 3092 | Processing ... _pimCreateOrUpdateAAMInventory

06/16/17 11:37:03:975 | [INFO] |  | ASU | PIM | PIM |  |  | 3092 | Inventory Already present on the machine...

06/16/17 11:37:03:976 | [INFO] |  | ASU | Setup | Setup |  |  | 3092 | TimeLog: End Installing. Now launching PDApp

06/16/17 11:37:04:480 | [INFO] |  | ASU | Setup | Setup |  |  | 3092 | Deployment File Path not specified in command line arguments. Skipping payload deployment part

06/16/17 11:37:04:481 | [INFO] |  | ASU | Setup |  |  |  | 3092 | Event Guid generated is: '73a38d82-153f-4ac8-bcc7-a9295e359f3f'

06/16/17 11:37:04:481 | [INFO] |  | ASU | Setup | Setup |  |  | 3092 | =================  End Adobe Setup. Exit code: 0  =================

06/16/17 11:37:04:486 | [INFO] |  | ASU | PIM | PIM |  |  | 3092 | PIMSqlite closeDB status 0

06/16/17 11:37:04:486 | [INFO] |  | ASU | PIM | PIM |  |  | 3092 | FREE PIM Instance ...

06/16/17 11:37:04:487 | [INFO] |  | ASU | Setup |  |  |  | 3092 | Waiting for the async thread to get the task completed

06/16/17 11:37:04:496 | [INFO] |  | ASU | Setup |  |  |  | 11024 | Event with guid '73a38d82-153f-4ac8-bcc7-a9295e359f3f' is being sent

06/16/17 11:37:04:507 | [INFO] |  | ASU | Setup |  |  | HTTPConnector | 11024 | GetIEProxyInfo - Failed to get proxy for the url, error:12180

06/16/17 11:37:06:341 | [INFO] |  | ASU | Setup |  |  | HTTPConnector | 6828 | HTTP Request Status code 200.

06/16/17 11:37:06:342 | [INFO] |  | ASU | Setup |  |  | HTTPConnector | 11024 | The http request returned HTTP_Status:0 HttpCommunicator error:0

06/16/17 11:37:06:343 | [INFO] |  | ASU | Setup |  |  |  | 11024 | Async thread is completed. Now exiting from function.

06/16/17 11:37:06:371 | [INFO] |  | ASU | DeploymentManager | DeploymentManager |  |  | 5572 | Build Version - 1.12.0.27

06/16/17 11:37:06:371 | [INFO] |  | ASU | DeploymentManager | DeploymentManager |  |  | 5572 | Logging Level verbosity Set  to 4

06/16/17 11:37:06:371 | [INFO] |  | ASU | DeploymentManager | DeploymentManager |  |  | 5572 | The return code from the Bootstrapper Process is (0).

06/16/17 11:37:06:371 | [INFO] |  | ASU | DeploymentManager | DeploymentManager |  |  | 5572 | Starting apply ASU Self-Update.

06/16/17 11:37:06:371 | [INFO] |  | ASU | DeploymentManager | DeploymentManager |  |  | 5572 | SelfUpdate Path - C:\WINDOWS\ccmcache\j\Patches\AdobeApplicationManager-1.0_update14

06/16/17 11:37:06:371 | [INFO] |  | ASU | DeploymentManager | DeploymentManager |  |  | 5572 | Bootstrapper launch location is :: C:\WINDOWS\ccmcache\j\Patches\AdobeApplicationManager-1.0_update14\Set-up.dat

06/16/17 11:37:06:480 | [INFO] |  | ASU | Setup | Setup |  |  | 5380 | Build Version - 9.0.0.141

06/16/17 11:37:06:480 | [INFO] |  | ASU | Setup | Setup |  |  | 5380 | Logging Level verbosity Set  to 4

06/16/17 11:37:06:480 | [INFO] |  | ASU | Setup |  |  |  | 5380 | Event Guid generated is: 'b66231e9-9013-4efc-9080-78546526d62c'

06/16/17 11:37:06:480 | [INFO] |  | ASU | Setup | Setup |  |  | 5380 | Start Adobe Setup

06/16/17 11:37:06:480 | [INFO] |  | ASU | Setup | Setup |  |  | 5380 | TimeLog: Bootstrapper Start

06/16/17 11:37:06:480 | [INFO] |  | ASU | Setup | Setup |  |  | 5380 | TimeLog: Start initial checks

06/16/17 11:37:06:480 | [INFO] |  | ASU | Setup | Setup |  |  | 5380 | Action specified - "install"

06/16/17 11:37:06:480 | [INFO] |  | ASU | Setup | PIM |  |  | 5380 | XML is valid

06/16/17 11:37:06:480 | [WARN] |  | ASU | Setup | PIM |  |  | 5380 | Failed to find Node

06/16/17 11:37:06:480 | [WARN] |  | ASU | Setup | Setup |  |  | 5380 | Reboot is pending from earlier installation.

06/16/17 11:37:06:480 | [INFO] |  | ASU | Setup | Utilities |  |  | 5380 | Semaphore is not locked

06/16/17 11:37:06:480 | [INFO] |  | ASU | PIM | PIM |  |  | 5380 | Build Version - 9.0.0.141

06/16/17 11:37:06:480 | [INFO] |  | ASU | PIM | PIM |  |  | 5380 | Logging Level verbosity Set  to 4

06/16/17 11:37:06:480 | [INFO] |  | ASU | PIM | PIM |  |  | 5380 | Build Version - 9.0.0.141

06/16/17 11:37:06:480 | [INFO] |  | ASU | PIM | PIM |  |  | 5380 | Logging Level verbosity Set  to 4

06/16/17 11:37:06:480 | [INFO] |  | ASU | PIM | PIM |  |  | 5380 | CREATE PIM Instance ...

06/16/17 11:37:06:480 | [INFO] |  | ASU | PIM | PIM |  |  | 5380 | trying to createOrUpdatePIMDbSchema.

06/16/17 11:37:06:496 | [INFO] |  | ASU | PIM | PIM |  |  | 5380 | Current db schema version on machine 1.

06/16/17 11:37:06:496 | [INFO] |  | ASU | PIM | PIM |  |  | 5380 | Current db schema version to install 1.

06/16/17 11:37:06:496 | [INFO] |  | ASU | PIM | PIM |  |  | 5380 | PIM DB Schema is up to date. Current schema version is 1.

06/16/17 11:37:06:496 | [INFO] |  | ASU | PIM | PIM |  |  | 5380 | PIM Database is Up To Date.

06/16/17 11:37:06:496 | [INFO] |  | ASU | PIM | PIM |  |  | 5380 | Updater Inventory location:C:\WINDOWS\ccmcache\j\Patches\AdobeApplicationManager-1.0_update14\resources\updaterinventory.dll

06/16/17 11:37:06:496 | [INFO] |  | ASU | PIM | PIM |  |  | 5380 | Acquired System level ACF lock ...

06/16/17 11:37:06:496 | [INFO] |  | ASU | Setup | Setup |  |  | 5380 | TimeLog: End initial checks

06/16/17 11:37:06:496 | [INFO] |  | ASU | Setup | Setup |  |  | 5380 | TimeLog: Begin Installing

06/16/17 11:37:06:496 | [INFO] |  | ASU | PIM | PIM |  |  | 5380 | Current OS version is: Major:10, Minor:0, ServicePack:0

06/16/17 11:37:06:496 | [INFO] |  | ASU | PIM | PIM |  |  | 5380 | XML is valid

06/16/17 11:37:06:496 | [WARN] |  | ASU | PIM | PIM |  |  | 5380 | Failed to find Node

06/16/17 11:37:06:496 | [INFO] |  | ASU | PIM | PIM |  |  | 5380 | Package id B12B2FC7-66D0-4766-BF19-081A48A2F372 is a Old Package, a newer package is installed in the system.

06/16/17 11:37:06:496 | [INFO] |  | ASU | PIM | PIM |  |  | 5380 | XML is valid

06/16/17 11:37:06:496 | [WARN] |  | ASU | PIM | PIM |  |  | 5380 | Failed to find Node

06/16/17 11:37:06:496 | [INFO] |  | ASU | PIM | PIM |  |  | 5380 | Package id B948115B-424C-443F-8047-B30C8B90BCA8 is a Old Package, a newer package is installed in the system.

06/16/17 11:37:06:496 | [INFO] |  | ASU | PIM | PIM |  |  | 5380 | XML is valid

06/16/17 11:37:06:496 | [WARN] |  | ASU | PIM | PIM |  |  | 5380 | Failed to find Node

06/16/17 11:37:06:496 | [INFO] |  | ASU | PIM | PIM |  |  | 5380 | Package id 0CDA4C3B-0E1F-49E0-A88A-FA6AA9979424 is a Old Package, a newer package is installed in the system.

06/16/17 11:37:06:512 | [INFO] |  | ASU | Setup |  |  |  | 9420 | Event with guid 'b66231e9-9013-4efc-9080-78546526d62c' is being sent

06/16/17 11:37:06:512 | [INFO] |  | ASU | PIM | PIM |  |  | 5380 | XML is valid

06/16/17 11:37:06:512 | [WARN] |  | ASU | PIM | PIM |  |  | 5380 | Failed to find Node

06/16/17 11:37:06:512 | [INFO] |  | ASU | PIM | PIM |  |  | 5380 | Package id DE9FAA6B-94F6-42A7-A9FD-B0D716ED3EED is a Old Package, a newer package is installed in the system.

06/16/17 11:37:06:512 | [INFO] |  | ASU | PIM | PIM |  |  | 5380 | XML is valid

06/16/17 11:37:06:512 | [WARN] |  | ASU | PIM | PIM |  |  | 5380 | Failed to find Node

06/16/17 11:37:06:512 | [INFO] |  | ASU | Setup |  |  | HTTPConnector | 9420 | GetIEProxyInfo - No default proxy present on the user machine

06/16/17 11:37:06:512 | [INFO] |  | ASU | PIM | PIM |  |  | 5380 | Package id 062E98C1-1625-4373-BC41-0831335A5A2B is already installed

06/16/17 11:37:06:512 | [INFO] |  | ASU | Setup |  |  | HTTPConnector | 9420 | GetIEProxyInfo - Failed to get proxy for the url, error:12180

06/16/17 11:37:06:512 | [INFO] |  | ASU | PIM | PIM |  |  | 5380 | XML is valid

06/16/17 11:37:06:512 | [WARN] |  | ASU | PIM | PIM |  |  | 5380 | Failed to find Node

06/16/17 11:37:06:512 | [INFO] |  | ASU | PIM | PIM |  |  | 5380 | Package id B322281B-C04F-438E-82D7-7DA34A359526 is a Old Package, a newer package is installed in the system.

06/16/17 11:37:06:527 | [INFO] |  | ASU | PIM | PIM |  |  | 5380 | XML is valid

06/16/17 11:37:06:527 | [WARN] |  | ASU | PIM | PIM |  |  | 5380 | Failed to find Node

06/16/17 11:37:06:527 | [INFO] |  | ASU | PIM | PIM |  |  | 5380 | Package id A8F3EA33-B0E0-43B2-990D-3DA2B0317B82 is a Old Package, a newer package is installed in the system.

06/16/17 11:37:06:527 | [INFO] |  | ASU | PIM | PIM |  |  | 5380 | XML is valid

06/16/17 11:37:06:527 | [WARN] |  | ASU | PIM | PIM |  |  | 5380 | Failed to find Node

06/16/17 11:37:06:527 | [INFO] |  | ASU | PIM | PIM |  |  | 5380 | Package id 3F9C8B10-559B-46D3-8053-9208FF459C01 is a Old Package, a newer package is installed in the system.

06/16/17 11:37:06:527 | [INFO] |  | ASU | PIM | PIM |  |  | 5380 | XML is valid

06/16/17 11:37:06:527 | [WARN] |  | ASU | PIM | PIM |  |  | 5380 | Failed to find Node

06/16/17 11:37:06:527 | [INFO] |  | ASU | PIM | PIM |  |  | 5380 | Package id 6A7BA94E-D704-4182-89A2-0C430D86D676 is a Old Package, a newer package is installed in the system.

06/16/17 11:37:06:527 | [INFO] |  | ASU | PIM | PIM |  |  | 5380 | XML is valid

06/16/17 11:37:06:527 | [WARN] |  | ASU | PIM | PIM |  |  | 5380 | Failed to find Node

06/16/17 11:37:06:527 | [INFO] |  | ASU | PIM | PIM |  |  | 5380 | Package id EFCC1FE1-DD11-4531-AF33-B3DC7A08B625 is a Old Package, a newer package is installed in the system.

06/16/17 11:37:06:527 | [INFO] |  | ASU | PIM | PIM |  |  | 5380 | XML is valid

06/16/17 11:37:06:527 | [WARN] |  | ASU | PIM | PIM |  |  | 5380 | Failed to find Node

06/16/17 11:37:06:527 | [INFO] |  | ASU | PIM | PIM |  |  | 5380 | Package id A1683289-8BD1-420E-8B0F-D32C6F436249 is a Old Package, a newer package is installed in the system.

06/16/17 11:37:06:527 | [INFO] |  | ASU | PIM | PIM |  |  | 5380 | pim_haveEnoughDiskSpaceToInstallPackages reqSize ... 15941768

06/16/17 11:37:06:527 | [INFO] |  | ASU | PIM | PIM |  |  | 5380 | Executing Adobe Genuine Validation for all the AAM packages

06/16/17 11:37:06:527 | [INFO] |  | ASU | PIM | PIM |  |  | 5380 | Validating package file: 'C:\WINDOWS\ccmcache\j\Patches\AdobeApplicationManager-1.0_update14\packages\core\PDApp.pimx'

06/16/17 11:37:06:527 | [INFO] |  | ASU | PIM | PIM |  |  | 5380 | Validating package file: 'C:\WINDOWS\ccmcache\j\Patches\AdobeApplicationManager-1.0_update14\packages\core\PDApp.pima'

06/16/17 11:37:06:527 | [INFO] |  | ASU | PIM | PIM |  |  | 5380 | Validating package file: 'C:\WINDOWS\ccmcache\j\Patches\AdobeApplicationManager-1.0_update14\packages\D6\D6.pimx'

06/16/17 11:37:06:543 | [INFO] |  | ASU | PIM | PIM |  |  | 5380 | Validating package file: 'C:\WINDOWS\ccmcache\j\Patches\AdobeApplicationManager-1.0_update14\packages\D6\D6.pima'

06/16/17 11:37:06:543 | [INFO] |  | ASU | PIM | PIM |  |  | 5380 | Validating package file: 'C:\WINDOWS\ccmcache\j\Patches\AdobeApplicationManager-1.0_update14\packages\DECore\DECore.pimx'

06/16/17 11:37:06:543 | [INFO] |  | ASU | PIM | PIM |  |  | 5380 | Validating package file: 'C:\WINDOWS\ccmcache\j\Patches\AdobeApplicationManager-1.0_update14\packages\DECore\DECore.pima'

06/16/17 11:37:06:543 | [INFO] |  | ASU | PIM | PIM |  |  | 5380 | Validating package file: 'C:\WINDOWS\ccmcache\j\Patches\AdobeApplicationManager-1.0_update14\packages\DWA\DWA.pimx'

06/16/17 11:37:06:543 | [INFO] |  | ASU | PIM | PIM |  |  | 5380 | Validating package file: 'C:\WINDOWS\ccmcache\j\Patches\AdobeApplicationManager-1.0_update14\packages\DWA\DWA.pima'

06/16/17 11:37:06:543 | [INFO] |  | ASU | PIM | PIM |  |  | 5380 | Validating package file: 'C:\WINDOWS\ccmcache\j\Patches\AdobeApplicationManager-1.0_update14\packages\P6\P6.pimx'

06/16/17 11:37:06:543 | [INFO] |  | ASU | PIM | PIM |  |  | 5380 | Validating package file: 'C:\WINDOWS\ccmcache\j\Patches\AdobeApplicationManager-1.0_update14\packages\P6\P6.pima'

06/16/17 11:37:06:543 | [INFO] |  | ASU | PIM | PIM |  |  | 5380 | Validating package file: 'C:\WINDOWS\ccmcache\j\Patches\AdobeApplicationManager-1.0_update14\packages\LWA\LWA.pimx'

06/16/17 11:37:06:543 | [INFO] |  | ASU | PIM | PIM |  |  | 5380 | Validating package file: 'C:\WINDOWS\ccmcache\j\Patches\AdobeApplicationManager-1.0_update14\packages\LWA\LWA.pima'

06/16/17 11:37:06:543 | [INFO] |  | ASU | PIM | PIM |  |  | 5380 | Validating package file: 'C:\WINDOWS\ccmcache\j\Patches\AdobeApplicationManager-1.0_update14\packages\UWA\UWA.pimx'

06/16/17 11:37:06:543 | [INFO] |  | ASU | PIM | PIM |  |  | 5380 | Validating package file: 'C:\WINDOWS\ccmcache\j\Patches\AdobeApplicationManager-1.0_update14\packages\UWA\UWA.pima'

06/16/17 11:37:06:543 | [INFO] |  | ASU | PIM | PIM |  |  | 5380 | Validating package file: 'C:\WINDOWS\ccmcache\j\Patches\AdobeApplicationManager-1.0_update14\packages\CCM\CCM.pimx'

06/16/17 11:37:06:543 | [INFO] |  | ASU | PIM | PIM |  |  | 5380 | Validating package file: 'C:\WINDOWS\ccmcache\j\Patches\AdobeApplicationManager-1.0_update14\packages\CCM\CCM.pima'

06/16/17 11:37:06:558 | [INFO] |  | ASU | PIM | PIM |  |  | 5380 | Validating package file: 'C:\WINDOWS\ccmcache\j\Patches\AdobeApplicationManager-1.0_update14\packages\IPC\IPC.pimx'

06/16/17 11:37:06:558 | [INFO] |  | ASU | PIM | PIM |  |  | 5380 | Validating package file: 'C:\WINDOWS\ccmcache\j\Patches\AdobeApplicationManager-1.0_update14\packages\IPC\IPC.pima'

06/16/17 11:37:06:558 | [INFO] |  | ASU | PIM | PIM |  |  | 5380 | Validating package file: 'C:\WINDOWS\ccmcache\j\Patches\AdobeApplicationManager-1.0_update14\packages\P7\P7.pimx'

06/16/17 11:37:06:558 | [INFO] |  | ASU | PIM | PIM |  |  | 5380 | Validating package file: 'C:\WINDOWS\ccmcache\j\Patches\AdobeApplicationManager-1.0_update14\packages\P7\P7.pima'

06/16/17 11:37:06:558 | [INFO] |  | ASU | PIM | PIM |  |  | 5380 | Validating package file: 'C:\WINDOWS\ccmcache\j\Patches\AdobeApplicationManager-1.0_update14\packages\AdobeGCClient\AdobeGCClient.pimx'

06/16/17 11:37:06:558 | [INFO] |  | ASU | PIM | PIM |  |  | 5380 | Validating package file: 'C:\WINDOWS\ccmcache\j\Patches\AdobeApplicationManager-1.0_update14\packages\AdobeGCClient\AdobeGCClient.pima'

06/16/17 11:37:06:558 | [INFO] |  | ASU | PIM | PIM |  |  | 5380 | Adobe Genuine Validation PASSED for all the AAM packages

06/16/17 11:37:06:558 | [INFO] |  | ASU | PIM | PIM |  |  | 5380 | START installPackage at file C:\WINDOWS\ccmcache\j\Patches\AdobeApplicationManager-1.0_update14\packages\core\PDApp.pimx

06/16/17 11:37:06:574 | [INFO] |  | ASU | PIM | PIM |  |  | 5380 | XML is valid

06/16/17 11:37:06:574 | [WARN] |  | ASU | PIM | PIM |  |  | 5380 | Failed to find Node

06/16/17 11:37:06:574 | [INFO] |  | ASU | PIM | PIM |  |  | 5380 | NOTE package id B12B2FC7-66D0-4766-BF19-081A48A2F372 is a Old Package, a newer package is installed in the system.

06/16/17 11:37:06:574 | [INFO] |  | ASU | PIM | PIM |  |  | 5380 | START installPackage at file C:\WINDOWS\ccmcache\j\Patches\AdobeApplicationManager-1.0_update14\packages\D6\D6.pimx

06/16/17 11:37:06:574 | [INFO] |  | ASU | PIM | PIM |  |  | 5380 | XML is valid

06/16/17 11:37:06:574 | [WARN] |  | ASU | PIM | PIM |  |  | 5380 | Failed to find Node

06/16/17 11:37:06:574 | [INFO] |  | ASU | PIM | PIM |  |  | 5380 | NOTE package id B948115B-424C-443F-8047-B30C8B90BCA8 is a Old Package, a newer package is installed in the system.

06/16/17 11:37:06:574 | [INFO] |  | ASU | PIM | PIM |  |  | 5380 | START installPackage at file C:\WINDOWS\ccmcache\j\Patches\AdobeApplicationManager-1.0_update14\packages\DECore\DECore.pimx

06/16/17 11:37:06:574 | [INFO] |  | ASU | PIM | PIM |  |  | 5380 | XML is valid

06/16/17 11:37:06:574 | [WARN] |  | ASU | PIM | PIM |  |  | 5380 | Failed to find Node

06/16/17 11:37:06:574 | [INFO] |  | ASU | PIM | PIM |  |  | 5380 | NOTE package id 0CDA4C3B-0E1F-49E0-A88A-FA6AA9979424 is a Old Package, a newer package is installed in the system.

06/16/17 11:37:06:574 | [INFO] |  | ASU | PIM | PIM |  |  | 5380 | START installPackage at file C:\WINDOWS\ccmcache\j\Patches\AdobeApplicationManager-1.0_update14\packages\DWA\DWA.pimx

06/16/17 11:37:06:574 | [INFO] |  | ASU | PIM | PIM |  |  | 5380 | XML is valid

06/16/17 11:37:06:574 | [WARN] |  | ASU | PIM | PIM |  |  | 5380 | Failed to find Node

06/16/17 11:37:06:574 | [INFO] |  | ASU | PIM | PIM |  |  | 5380 | NOTE package id DE9FAA6B-94F6-42A7-A9FD-B0D716ED3EED is a Old Package, a newer package is installed in the system.

06/16/17 11:37:06:574 | [INFO] |  | ASU | PIM | PIM |  |  | 5380 | START installPackage at file C:\WINDOWS\ccmcache\j\Patches\AdobeApplicationManager-1.0_update14\packages\P6\P6.pimx

06/16/17 11:37:06:574 | [INFO] |  | ASU | PIM | PIM |  |  | 5380 | XML is valid

06/16/17 11:37:06:574 | [WARN] |  | ASU | PIM | PIM |  |  | 5380 | Failed to find Node

06/16/17 11:37:06:574 | [INFO] |  | ASU | PIM | PIM |  |  | 5380 | Package id 062E98C1-1625-4373-BC41-0831335A5A2B is already installed

06/16/17 11:37:06:590 | [INFO] |  | ASU | PIM | PIM |  |  | 5380 | SUCCESS deleteAppletRegInfoRecords.

06/16/17 11:37:06:621 | [INFO] |  | ASU | PIM | PIM |  |  | 5380 | SUCCESS deletePackageUpgradeInfoRecords.

06/16/17 11:37:06:621 | [INFO] |  | ASU | PIM | PIM |  |  | 5380 | SUCCESS deletePackageInstallationInfoRecords.

06/16/17 11:37:06:871 | [INFO] |  | ASU | PIM | PIM |  |  | 5380 | SUCCESS insertPackageUpdateList.

06/16/17 11:37:06:871 | [INFO] |  | ASU | PIM | PIM |  |  | 5380 | SUCCESS insertAppletRegInfoList.

06/16/17 11:37:06:871 | [INFO] |  | ASU | PIM | PIM |  |  | 5380 | Backup Folder Created

06/16/17 11:37:07:277 | [INFO] |  | ASU | PIM | Utilities |  |  | 5380 | Directory not present

06/16/17 11:37:07:277 | [INFO] |  | ASU | PIM | PIM |  |  | 5380 | ERROR Failed Delete backed up assets

06/16/17 11:37:07:277 | [INFO] |  | ASU | PIM | PIM |  |  | 5380 | Trying to delete back up folder 'C:\Program Files (x86)\Common Files\Adobe\OOBE\PDApp\P6_bkp1'

06/16/17 11:37:07:387 | [INFO] |  | ASU | PIM | PIM |  |  | 5380 | SUCCESS installPackage at file C:\WINDOWS\ccmcache\j\Patches\AdobeApplicationManager-1.0_update14\packages\P6\P6.pimx.

06/16/17 11:37:07:402 | [INFO] |  | ASU | PIM | PIM |  |  | 5380 | START installPackage at file C:\WINDOWS\ccmcache\j\Patches\AdobeApplicationManager-1.0_update14\packages\LWA\LWA.pimx

06/16/17 11:37:07:402 | [INFO] |  | ASU | PIM | PIM |  |  | 5380 | XML is valid

06/16/17 11:37:07:402 | [WARN] |  | ASU | PIM | PIM |  |  | 5380 | Failed to find Node

06/16/17 11:37:07:402 | [INFO] |  | ASU | PIM | PIM |  |  | 5380 | NOTE package id B322281B-C04F-438E-82D7-7DA34A359526 is a Old Package, a newer package is installed in the system.

06/16/17 11:37:07:402 | [INFO] |  | ASU | PIM | PIM |  |  | 5380 | START installPackage at file C:\WINDOWS\ccmcache\j\Patches\AdobeApplicationManager-1.0_update14\packages\UWA\UWA.pimx

06/16/17 11:37:07:402 | [INFO] |  | ASU | PIM | PIM |  |  | 5380 | XML is valid

06/16/17 11:37:07:402 | [WARN] |  | ASU | PIM | PIM |  |  | 5380 | Failed to find Node

06/16/17 11:37:07:402 | [INFO] |  | ASU | PIM | PIM |  |  | 5380 | NOTE package id A8F3EA33-B0E0-43B2-990D-3DA2B0317B82 is a Old Package, a newer package is installed in the system.

06/16/17 11:37:07:402 | [INFO] |  | ASU | PIM | PIM |  |  | 5380 | START installPackage at file C:\WINDOWS\ccmcache\j\Patches\AdobeApplicationManager-1.0_update14\packages\CCM\CCM.pimx

06/16/17 11:37:07:402 | [INFO] |  | ASU | PIM | PIM |  |  | 5380 | XML is valid

06/16/17 11:37:07:402 | [WARN] |  | ASU | PIM | PIM |  |  | 5380 | Failed to find Node

06/16/17 11:37:07:418 | [INFO] |  | ASU | PIM | PIM |  |  | 5380 | NOTE package id 3F9C8B10-559B-46D3-8053-9208FF459C01 is a Old Package, a newer package is installed in the system.

06/16/17 11:37:07:418 | [INFO] |  | ASU | PIM | PIM |  |  | 5380 | START installPackage at file C:\WINDOWS\ccmcache\j\Patches\AdobeApplicationManager-1.0_update14\packages\IPC\IPC.pimx

06/16/17 11:37:07:418 | [INFO] |  | ASU | PIM | PIM |  |  | 5380 | XML is valid

06/16/17 11:37:07:418 | [WARN] |  | ASU | PIM | PIM |  |  | 5380 | Failed to find Node

06/16/17 11:37:07:418 | [INFO] |  | ASU | PIM | PIM |  |  | 5380 | NOTE package id 6A7BA94E-D704-4182-89A2-0C430D86D676 is a Old Package, a newer package is installed in the system.

06/16/17 11:37:07:418 | [INFO] |  | ASU | PIM | PIM |  |  | 5380 | START installPackage at file C:\WINDOWS\ccmcache\j\Patches\AdobeApplicationManager-1.0_update14\packages\P7\P7.pimx

06/16/17 11:37:07:418 | [INFO] |  | ASU | PIM | PIM |  |  | 5380 | XML is valid

06/16/17 11:37:07:418 | [WARN] |  | ASU | PIM | PIM |  |  | 5380 | Failed to find Node

06/16/17 11:37:07:418 | [INFO] |  | ASU | PIM | PIM |  |  | 5380 | NOTE package id EFCC1FE1-DD11-4531-AF33-B3DC7A08B625 is a Old Package, a newer package is installed in the system.

06/16/17 11:37:07:418 | [INFO] |  | ASU | PIM | PIM |  |  | 5380 | START installPackage at file C:\WINDOWS\ccmcache\j\Patches\AdobeApplicationManager-1.0_update14\packages\AdobeGCClient\AdobeGCClient.pimx

06/16/17 11:37:07:418 | [INFO] |  | ASU | PIM | PIM |  |  | 5380 | XML is valid

06/16/17 11:37:07:418 | [WARN] |  | ASU | PIM | PIM |  |  | 5380 | Failed to find Node

06/16/17 11:37:07:418 | [INFO] |  | ASU | PIM | PIM |  |  | 5380 | NOTE package id A1683289-8BD1-420E-8B0F-D32C6F436249 is a Old Package, a newer package is installed in the system.

06/16/17 11:37:07:434 | [INFO] |  | ASU | PIM | PIM |  |  | 5380 | Processing ... _pimCreateOrUpdateAAMInventory

06/16/17 11:37:07:434 | [INFO] |  | ASU | PIM | PIM |  |  | 5380 | Higher version of AAM Updater inventory is already present in the machine. So skipping the creation of AAM Updater Inventory

06/16/17 11:37:07:434 | [INFO] |  | ASU | PIM | PIM |  |  | 5380 | Return ... SUCCESS _pimCreateOrUpdateAAMInventory

06/16/17 11:37:07:434 | [INFO] |  | ASU | Setup | Setup |  |  | 5380 | TimeLog: End Installing. Now launching PDApp

06/16/17 11:37:07:949 | [INFO] |  | ASU | Setup |  |  |  | 5380 | Event Guid generated is: '9c3b2173-0b33-4a7e-90fa-8751be255210'

06/16/17 11:37:07:949 | [INFO] |  | ASU | Setup | Setup |  |  | 5380 | =================  End Adobe Setup. Exit code: 0  =================

06/16/17 11:37:07:949 | [INFO] |  | ASU | PIM | PIM |  |  | 5380 | PIMSqlite closeDB status 0

06/16/17 11:37:07:949 | [INFO] |  | ASU | PIM | PIM |  |  | 5380 | FREE PIM Instance ...

06/16/17 11:37:07:949 | [INFO] |  | ASU | Setup |  |  |  | 5380 | Waiting for the async thread to get the task completed

06/16/17 11:37:08:340 | [INFO] |  | ASU | Setup |  |  | HTTPConnector | 9188 | HTTP Request Status code 200.

06/16/17 11:37:08:340 | [INFO] |  | ASU | Setup |  |  | HTTPConnector | 9420 | The http request returned HTTP_Status:0 HttpCommunicator error:0

06/16/17 11:37:08:340 | [INFO] |  | ASU | Setup |  |  |  | 9420 | Event with guid '9c3b2173-0b33-4a7e-90fa-8751be255210' is being sent

06/16/17 11:37:08:356 | [INFO] |  | ASU | Setup |  |  | HTTPConnector | 9420 | GetIEProxyInfo - No default proxy present on the user machine

06/16/17 11:37:08:356 | [INFO] |  | ASU | Setup |  |  | HTTPConnector | 9420 | GetIEProxyInfo - Failed to get proxy for the url, error:12180

06/16/17 11:37:10:153 | [INFO] |  | ASU | Setup |  |  | HTTPConnector | 5640 | HTTP Request Status code 200.

06/16/17 11:37:10:153 | [INFO] |  | ASU | Setup |  |  | HTTPConnector | 9420 | The http request returned HTTP_Status:0 HttpCommunicator error:0

06/16/17 11:37:10:153 | [INFO] |  | ASU | Setup |  |  |  | 9420 | Async thread is completed. Now exiting from function.

06/16/17 11:37:10:193 | [INFO] |  | ASU | DeploymentManager | DeploymentManager |  |  | 5572 | Build Version - 1.12.0.27

06/16/17 11:37:10:193 | [INFO] |  | ASU | DeploymentManager | DeploymentManager |  |  | 5572 | Logging Level verbosity Set  to 4

06/16/17 11:37:10:193 | [INFO] |  | ASU | DeploymentManager | DeploymentManager |  |  | 5572 | The return code from the Bootstrapper Process is (0).

06/16/17 11:37:10:193 | [INFO] |  | ASU | DeploymentManager | DeploymentManager |  |  | 5572 | No conflicting processes were defined for the products, skipping the conflicting process check ...

06/16/17 11:37:10:210 | [INFO] |  | ASU | DeploymentManager | DeploymentManager |  |  | 5572 | Not adding payload ({3E272A93-C06B-4206-AD02-0EBE02535E20}) to the rollback script, as the payload has already been installed on the machine.

06/16/17 11:37:10:211 | [INFO] |  | ASU | DeploymentManager | DeploymentManager |  |  | 5572 | Not adding payload ({4CED09CB-0C96-4EAE-83C4-7D9B9456E613}) to the rollback script, as the payload has already been installed on the machine.

06/16/17 11:37:10:211 | [INFO] |  | ASU | DeploymentManager | DeploymentManager |  |  | 5572 | Not adding payload ({539B5BB0-18F9-11E2-BBBC-00215AEA26C9}) to the rollback script, as the payload has already been installed on the machine.

06/16/17 11:37:10:211 | [INFO] |  | ASU | DeploymentManager | DeploymentManager |  |  | 5572 | Not adding payload ({54B0C34F-18F9-11E2-BC1D-00215AEA26C9}) to the rollback script, as the payload has already been installed on the machine.

06/16/17 11:37:10:211 | [INFO] |  | ASU | DeploymentManager | DeploymentManager |  |  | 5572 | Not adding payload ({55B82130-18F9-11E2-8D43-00215AEA26C9}) to the rollback script, as the payload has already been installed on the machine.

06/16/17 11:37:10:211 | [INFO] |  | ASU | DeploymentManager | DeploymentManager |  |  | 5572 | Not adding payload ({636D196A-789E-455D-825E-3FA79F67D446}) to the rollback script, as the payload has already been installed on the machine.

06/16/17 11:37:10:211 | [INFO] |  | ASU | DeploymentManager | DeploymentManager |  |  | 5572 | Not adding payload ({873BE68F-480F-49A6-9649-F98CAB056AFC}) to the rollback script, as the payload has already been installed on the machine.

06/16/17 11:37:10:287 | [INFO] |  | ASU | DeploymentManager | DeploymentManager |  |  | 5572 | STEP 3: Starting to launch Bootstrapper of Media (CPTV10.0).

06/16/17 11:37:10:287 | [INFO] |  | ASU | DeploymentManager | DeploymentManager |  |  | 5572 | Bootstrapper launch location is :: C:\WINDOWS\ccmcache\j\Setup\CPTV10.0\Set-up.dat

06/16/17 11:37:10:340 | [INFO] |  | ASU | Setup | Setup |  |  | 3400 | Build Version - 9.0.0.108

06/16/17 11:37:10:340 | [INFO] |  | ASU | Setup | Setup |  |  | 3400 | Logging Level verbosity Set  to 4

06/16/17 11:37:10:356 | [INFO] |  | ASU | Setup |  |  |  | 3400 | Event Guid generated is: 'b75603ce-1350-42e4-8f65-85ec2be30d56'

06/16/17 11:37:10:356 | [INFO] |  | ASU | Setup | Setup |  |  | 3400 | Start Adobe Setup

06/16/17 11:37:10:356 | [INFO] |  | ASU | Setup | Setup |  |  | 3400 | TimeLog: Bootstrapper Start

06/16/17 11:37:10:356 | [INFO] |  | ASU | Setup | Setup |  |  | 3400 | TimeLog: Start initial checks

06/16/17 11:37:10:356 | [INFO] |  | ASU | Setup | Setup |  |  | 3400 | Action specified - "install"

06/16/17 11:37:10:356 | [INFO] |  | ASU | Setup | PIM |  |  | 3400 | XML is valid

06/16/17 11:37:10:356 | [WARN] |  | ASU | Setup | PIM |  |  | 3400 | Failed to find Node

06/16/17 11:37:10:356 | [WARN] |  | ASU | Setup | Setup |  |  | 3400 | Reboot is pending from earlier installation.

06/16/17 11:37:10:356 | [INFO] |  | ASU | Setup | Utilities |  |  | 3400 | Semaphore is not locked

06/16/17 11:37:10:356 | [INFO] |  | ASU | PIM | PIM |  |  | 3400 | Build Version - 9.0.0.108

06/16/17 11:37:10:356 | [INFO] |  | ASU | PIM | PIM |  |  | 3400 | Logging Level verbosity Set  to 4

06/16/17 11:37:10:356 | [INFO] |  | ASU | PIM | PIM |  |  | 3400 | Build Version - 9.0.0.108

06/16/17 11:37:10:356 | [INFO] |  | ASU | PIM | PIM |  |  | 3400 | Logging Level verbosity Set  to 4

06/16/17 11:37:10:356 | [INFO] |  | ASU | PIM | PIM |  |  | 3400 | CREATE PIM Instance ...

06/16/17 11:37:10:356 | [INFO] |  | ASU | PIM | PIM |  |  | 3400 | trying to createOrUpdatePIMDbSchema.

06/16/17 11:37:10:356 | [INFO] |  | ASU | PIM | PIM |  |  | 3400 | Current db schema version on machine 1.

06/16/17 11:37:10:356 | [INFO] |  | ASU | PIM | PIM |  |  | 3400 | Current db schema version to install 1.

06/16/17 11:37:10:356 | [INFO] |  | ASU | PIM | PIM |  |  | 3400 | PIM DB Schema is up to date. Current schema version is 1.

06/16/17 11:37:10:356 | [INFO] |  | ASU | PIM | PIM |  |  | 3400 | PIM Database is Up To Date.

06/16/17 11:37:10:356 | [INFO] |  | ASU | PIM | PIM |  |  | 3400 | Updater Inventory location:C:\WINDOWS\ccmcache\j\Setup\CPTV10.0\resources\updaterinventory.dll

06/16/17 11:37:10:356 | [INFO] |  | ASU | PIM | PIM |  |  | 3400 | Acquired System level ACF lock ...

06/16/17 11:37:10:356 | [INFO] |  | ASU | Setup | Setup |  |  | 3400 | TimeLog: End initial checks

06/16/17 11:37:10:356 | [INFO] |  | ASU | Setup | Setup |  |  | 3400 | TimeLog: Begin Installing

06/16/17 11:37:10:356 | [INFO] |  | ASU | PIM | PIM |  |  | 3400 | Current OS version is: Major:10, Minor:0, ServicePack:0

06/16/17 11:37:10:371 | [INFO] |  | ASU | Setup |  |  |  | 9768 | Event with guid 'b75603ce-1350-42e4-8f65-85ec2be30d56' is being sent

06/16/17 11:37:10:371 | [INFO] |  | ASU | PIM | PIM |  |  | 3400 | XML is valid

06/16/17 11:37:10:371 | [INFO] |  | ASU | Setup |  |  |  | 9768 | GetIEProxyInfo - No default proxy present on the user machine

06/16/17 11:37:10:371 | [WARN] |  | ASU | PIM | PIM |  |  | 3400 | Failed to find Node

06/16/17 11:37:10:371 | [INFO] |  | ASU | PIM | PIM |  |  | 3400 | Package id 0DB1BF63-1E6F-40D0-AEC7-A8191417578E is a Old Package, a newer package is installed in the system.

06/16/17 11:37:10:371 | [INFO] |  | ASU | Setup |  |  |  | 9768 | GetIEProxyInfo - Failed to get proxy for the url, error:12006

06/16/17 11:37:10:371 | [INFO] |  | ASU | Setup |  |  |  | 9768 | GetIEProxyInfo - proxy Url is

06/16/17 11:37:10:371 | [INFO] |  | ASU | PIM | PIM |  |  | 3400 | XML is valid

06/16/17 11:37:10:371 | [WARN] |  | ASU | PIM | PIM |  |  | 3400 | Failed to find Node

06/16/17 11:37:10:371 | [INFO] |  | ASU | PIM | PIM |  |  | 3400 | Package id A50F059F-C3BA-4D85-838F-670663027832 is a Old Package, a newer package is installed in the system.

06/16/17 11:37:10:387 | [INFO] |  | ASU | PIM | PIM |  |  | 3400 | XML is valid

06/16/17 11:37:10:387 | [WARN] |  | ASU | PIM | PIM |  |  | 3400 | Failed to find Node

06/16/17 11:37:10:387 | [INFO] |  | ASU | PIM | PIM |  |  | 3400 | Package id 69A0A5A4-E37B-4A28-9CAF-FDAB54E6B438 is a Old Package, a newer package is installed in the system.

06/16/17 11:37:10:387 | [INFO] |  | ASU | PIM | PIM |  |  | 3400 | XML is valid

06/16/17 11:37:10:387 | [WARN] |  | ASU | PIM | PIM |  |  | 3400 | Failed to find Node

06/16/17 11:37:10:387 | [INFO] |  | ASU | PIM | PIM |  |  | 3400 | Package id E1991EA9-E359-43BA-9DBE-F2657FFAABF4 is already installed

06/16/17 11:37:10:387 | [INFO] |  | ASU | PIM | PIM |  |  | 3400 | XML is valid

06/16/17 11:37:10:387 | [WARN] |  | ASU | PIM | PIM |  |  | 3400 | Failed to find Node

06/16/17 11:37:10:387 | [INFO] |  | ASU | PIM | PIM |  |  | 3400 | Package id 68BF9F96-CC6F-4CC1-9C3B-D8F28853EB6E is a Old Package, a newer package is installed in the system.

06/16/17 11:37:10:387 | [INFO] |  | ASU | PIM | PIM |  |  | 3400 | XML is valid

06/16/17 11:37:10:387 | [WARN] |  | ASU | PIM | PIM |  |  | 3400 | Failed to find Node

06/16/17 11:37:10:387 | [INFO] |  | ASU | PIM | PIM |  |  | 3400 | Package id 71796FCB-CA48-4BD1-9D93-D51093659A17 is already installed

06/16/17 11:37:10:403 | [INFO] |  | ASU | PIM | PIM |  |  | 3400 | XML is valid

06/16/17 11:37:10:403 | [WARN] |  | ASU | PIM | PIM |  |  | 3400 | Failed to find Node

06/16/17 11:37:10:403 | [INFO] |  | ASU | PIM | PIM |  |  | 3400 | Package id 26AAFE59-2AED-42FA-BC89-D464375D7D36 is a Old Package, a newer package is installed in the system.

06/16/17 11:37:10:418 | [INFO] |  | ASU | PIM | PIM |  |  | 3400 | XML is valid

06/16/17 11:37:10:418 | [WARN] |  | ASU | PIM | PIM |  |  | 3400 | Failed to find Node

06/16/17 11:37:10:418 | [INFO] |  | ASU | PIM | PIM |  |  | 3400 | Package id F8569346-D222-46B5-81BA-661752149042 is a Old Package, a newer package is installed in the system.

06/16/17 11:37:10:418 | [INFO] |  | ASU | PIM | PIM |  |  | 3400 | XML is valid

06/16/17 11:37:10:418 | [WARN] |  | ASU | PIM | PIM |  |  | 3400 | Failed to find Node

06/16/17 11:37:10:418 | [INFO] |  | ASU | PIM | PIM |  |  | 3400 | Package id CA4E0356-60B7-4B4B-BAE0-A6E0537F6ECD is a Old Package, a newer package is installed in the system.

06/16/17 11:37:10:418 | [INFO] |  | ASU | PIM | PIM |  |  | 3400 | XML is valid

06/16/17 11:37:10:418 | [WARN] |  | ASU | PIM | PIM |  |  | 3400 | Failed to find Node

06/16/17 11:37:10:418 | [INFO] |  | ASU | PIM | PIM |  |  | 3400 | Package id B5EA99F6-6556-4F6E-838F-696DCED8152E is a Old Package, a newer package is installed in the system.

06/16/17 11:37:10:418 | [INFO] |  | ASU | PIM | PIM |  |  | 3400 | pim_haveEnoughDiskSpaceToInstallPackages reqSize ... 12069932

06/16/17 11:37:10:418 | [INFO] |  | ASU | PIM | PIM |  |  | 3400 | Executing Adobe Genuine Validation for all the AAM packages

06/16/17 11:37:10:418 | [INFO] |  | ASU | PIM | PIM |  |  | 3400 | Validating package file: 'C:\WINDOWS\ccmcache\j\Setup\CPTV10.0\packages\core\PDApp.pimx'

06/16/17 11:37:10:418 | [INFO] |  | ASU | PIM | PIM |  |  | 3400 | Validating package file: 'C:\WINDOWS\ccmcache\j\Setup\CPTV10.0\packages\core\PDApp.pima'

06/16/17 11:37:10:418 | [INFO] |  | ASU | PIM | PIM |  |  | 3400 | Validating package file: 'C:\WINDOWS\ccmcache\j\Setup\CPTV10.0\packages\D6\D6.pimx'

06/16/17 11:37:10:418 | [INFO] |  | ASU | PIM | PIM |  |  | 3400 | Validating package file: 'C:\WINDOWS\ccmcache\j\Setup\CPTV10.0\packages\D6\D6.pima'

06/16/17 11:37:10:418 | [INFO] |  | ASU | PIM | PIM |  |  | 3400 | Validating package file: 'C:\WINDOWS\ccmcache\j\Setup\CPTV10.0\packages\DECore\DECore.pimx'

06/16/17 11:37:10:434 | [INFO] |  | ASU | PIM | PIM |  |  | 3400 | Validating package file: 'C:\WINDOWS\ccmcache\j\Setup\CPTV10.0\packages\DECore\DECore.pima'

06/16/17 11:37:10:434 | [INFO] |  | ASU | PIM | PIM |  |  | 3400 | Validating package file: 'C:\WINDOWS\ccmcache\j\Setup\CPTV10.0\packages\DWA\DWA.pimx'

06/16/17 11:37:10:434 | [INFO] |  | ASU | PIM | PIM |  |  | 3400 | Validating package file: 'C:\WINDOWS\ccmcache\j\Setup\CPTV10.0\packages\DWA\DWA.pima'

06/16/17 11:37:10:434 | [INFO] |  | ASU | PIM | PIM |  |  | 3400 | Validating package file: 'C:\WINDOWS\ccmcache\j\Setup\CPTV10.0\packages\P6\P6.pimx'

06/16/17 11:37:10:434 | [INFO] |  | ASU | PIM | PIM |  |  | 3400 | Validating package file: 'C:\WINDOWS\ccmcache\j\Setup\CPTV10.0\packages\P6\P6.pima'

06/16/17 11:37:10:434 | [INFO] |  | ASU | PIM | PIM |  |  | 3400 | Validating package file: 'C:\WINDOWS\ccmcache\j\Setup\CPTV10.0\packages\LWA\LWA.pimx'

06/16/17 11:37:10:434 | [INFO] |  | ASU | PIM | PIM |  |  | 3400 | Validating package file: 'C:\WINDOWS\ccmcache\j\Setup\CPTV10.0\packages\LWA\LWA.pima'

06/16/17 11:37:10:434 | [INFO] |  | ASU | PIM | PIM |  |  | 3400 | Validating package file: 'C:\WINDOWS\ccmcache\j\Setup\CPTV10.0\packages\UWA\UWA.pimx'

06/16/17 11:37:10:434 | [INFO] |  | ASU | PIM | PIM |  |  | 3400 | Validating package file: 'C:\WINDOWS\ccmcache\j\Setup\CPTV10.0\packages\UWA\UWA.pima'

06/16/17 11:37:10:434 | [INFO] |  | ASU | PIM | PIM |  |  | 3400 | Validating package file: 'C:\WINDOWS\ccmcache\j\Setup\CPTV10.0\packages\CCM\CCM.pimx'

06/16/17 11:37:10:450 | [INFO] |  | ASU | PIM | PIM |  |  | 3400 | Validating package file: 'C:\WINDOWS\ccmcache\j\Setup\CPTV10.0\packages\CCM\CCM.pima'

06/16/17 11:37:10:450 | [INFO] |  | ASU | PIM | PIM |  |  | 3400 | Validating package file: 'C:\WINDOWS\ccmcache\j\Setup\CPTV10.0\packages\IPC\IPC.pimx'

06/16/17 11:37:10:450 | [INFO] |  | ASU | PIM | PIM |  |  | 3400 | Validating package file: 'C:\WINDOWS\ccmcache\j\Setup\CPTV10.0\packages\IPC\IPC.pima'

06/16/17 11:37:10:450 | [INFO] |  | ASU | PIM | PIM |  |  | 3400 | Validating package file: 'C:\WINDOWS\ccmcache\j\Setup\CPTV10.0\packages\P7\P7.pimx'

06/16/17 11:37:10:450 | [INFO] |  | ASU | PIM | PIM |  |  | 3400 | Validating package file: 'C:\WINDOWS\ccmcache\j\Setup\CPTV10.0\packages\P7\P7.pima'

06/16/17 11:37:10:450 | [INFO] |  | ASU | PIM | PIM |  |  | 3400 | Adobe Genuine Validation PASSED for all the AAM packages

06/16/17 11:37:10:450 | [INFO] |  | ASU | PIM | PIM |  |  | 3400 | START installPackage at file C:\WINDOWS\ccmcache\j\Setup\CPTV10.0\packages\core\PDApp.pimx

06/16/17 11:37:10:465 | [INFO] |  | ASU | PIM | PIM |  |  | 3400 | XML is valid

06/16/17 11:37:10:465 | [WARN] |  | ASU | PIM | PIM |  |  | 3400 | Failed to find Node

06/16/17 11:37:10:465 | [INFO] |  | ASU | PIM | PIM |  |  | 3400 | NOTE package id 0DB1BF63-1E6F-40D0-AEC7-A8191417578E is a Old Package, a newer package is installed in the system.

06/16/17 11:37:10:465 | [INFO] |  | ASU | PIM | PIM |  |  | 3400 | START installPackage at file C:\WINDOWS\ccmcache\j\Setup\CPTV10.0\packages\D6\D6.pimx

06/16/17 11:37:10:465 | [INFO] |  | ASU | PIM | PIM |  |  | 3400 | XML is valid

06/16/17 11:37:10:465 | [WARN] |  | ASU | PIM | PIM |  |  | 3400 | Failed to find Node

06/16/17 11:37:10:465 | [INFO] |  | ASU | PIM | PIM |  |  | 3400 | NOTE package id A50F059F-C3BA-4D85-838F-670663027832 is a Old Package, a newer package is installed in the system.

06/16/17 11:37:10:465 | [INFO] |  | ASU | PIM | PIM |  |  | 3400 | START installPackage at file C:\WINDOWS\ccmcache\j\Setup\CPTV10.0\packages\DECore\DECore.pimx

06/16/17 11:37:10:465 | [INFO] |  | ASU | PIM | PIM |  |  | 3400 | XML is valid

06/16/17 11:37:10:465 | [WARN] |  | ASU | PIM | PIM |  |  | 3400 | Failed to find Node

06/16/17 11:37:10:465 | [INFO] |  | ASU | PIM | PIM |  |  | 3400 | NOTE package id 69A0A5A4-E37B-4A28-9CAF-FDAB54E6B438 is a Old Package, a newer package is installed in the system.

06/16/17 11:37:10:465 | [INFO] |  | ASU | PIM | PIM |  |  | 3400 | START installPackage at file C:\WINDOWS\ccmcache\j\Setup\CPTV10.0\packages\DWA\DWA.pimx

06/16/17 11:37:10:465 | [INFO] |  | ASU | PIM | PIM |  |  | 3400 | XML is valid

06/16/17 11:37:10:465 | [WARN] |  | ASU | PIM | PIM |  |  | 3400 | Failed to find Node

06/16/17 11:37:10:465 | [INFO] |  | ASU | PIM | PIM |  |  | 3400 | Package id E1991EA9-E359-43BA-9DBE-F2657FFAABF4 is already installed

06/16/17 11:37:10:496 | [INFO] |  | ASU | PIM | PIM |  |  | 3400 | SUCCESS deleteAppletRegInfoRecords.

06/16/17 11:37:10:512 | [INFO] |  | ASU | PIM | PIM |  |  | 3400 | SUCCESS deletePackageUpgradeInfoRecords.

06/16/17 11:37:10:512 | [INFO] |  | ASU | PIM | PIM |  |  | 3400 | SUCCESS deletePackageInstallationInfoRecords.

06/16/17 11:37:10:543 | [INFO] |  | ASU | PIM | PIM |  |  | 3400 | SUCCESS insertPackageUpdateList.

06/16/17 11:37:10:543 | [INFO] |  | ASU | PIM | PIM |  |  | 3400 | SUCCESS insertAppletRegInfoList.

06/16/17 11:37:10:543 | [INFO] |  | ASU | PIM | PIM |  |  | 3400 | Backup Folder Created

06/16/17 11:37:10:590 | [WARN] |  | ASU | PIM | PIM |  |  | 3400 | Failed to find Node

06/16/17 11:37:10:715 | [INFO] |  | ASU | PIM | Utilities |  |  | 3400 | Directory not present

06/16/17 11:37:10:715 | [INFO] |  | ASU | PIM | PIM |  |  | 3400 | ERROR Failed Delete backed up assets

06/16/17 11:37:10:715 | [INFO] |  | ASU | PIM | PIM |  |  | 3400 | Trying to delete back up folder 'C:\Program Files (x86)\Common Files\Adobe\OOBE\PDApp\DWA_bkp1'

06/16/17 11:37:10:840 | [INFO] |  | ASU | PIM | PIM |  |  | 3400 | SUCCESS installPackage at file C:\WINDOWS\ccmcache\j\Setup\CPTV10.0\packages\DWA\DWA.pimx.

06/16/17 11:37:10:856 | [INFO] |  | ASU | PIM | PIM |  |  | 3400 | START installPackage at file C:\WINDOWS\ccmcache\j\Setup\CPTV10.0\packages\P6\P6.pimx

06/16/17 11:37:10:856 | [INFO] |  | ASU | PIM | PIM |  |  | 3400 | XML is valid

06/16/17 11:37:10:856 | [WARN] |  | ASU | PIM | PIM |  |  | 3400 | Failed to find Node

06/16/17 11:37:10:856 | [INFO] |  | ASU | PIM | PIM |  |  | 3400 | NOTE package id 68BF9F96-CC6F-4CC1-9C3B-D8F28853EB6E is a Old Package, a newer package is installed in the system.

06/16/17 11:37:10:856 | [INFO] |  | ASU | PIM | PIM |  |  | 3400 | START installPackage at file C:\WINDOWS\ccmcache\j\Setup\CPTV10.0\packages\LWA\LWA.pimx

06/16/17 11:37:10:872 | [INFO] |  | ASU | PIM | PIM |  |  | 3400 | XML is valid

06/16/17 11:37:10:872 | [WARN] |  | ASU | PIM | PIM |  |  | 3400 | Failed to find Node

06/16/17 11:37:10:872 | [INFO] |  | ASU | PIM | PIM |  |  | 3400 | Package id 71796FCB-CA48-4BD1-9D93-D51093659A17 is already installed

06/16/17 11:37:10:887 | [INFO] |  | ASU | PIM | PIM |  |  | 3400 | SUCCESS deleteAppletRegInfoRecords.

06/16/17 11:37:10:903 | [INFO] |  | ASU | PIM | PIM |  |  | 3400 | SUCCESS deletePackageUpgradeInfoRecords.

06/16/17 11:37:10:903 | [INFO] |  | ASU | PIM | PIM |  |  | 3400 | SUCCESS deletePackageInstallationInfoRecords.

06/16/17 11:37:10:918 | [INFO] |  | ASU | PIM | PIM |  |  | 3400 | SUCCESS insertPackageUpdateList.

06/16/17 11:37:10:918 | [INFO] |  | ASU | PIM | PIM |  |  | 3400 | SUCCESS insertAppletRegInfoList.

06/16/17 11:37:10:918 | [INFO] |  | ASU | PIM | PIM |  |  | 3400 | Backup Folder Created

06/16/17 11:37:10:950 | [WARN] |  | ASU | PIM | PIM |  |  | 3400 | Failed to find Node

06/16/17 11:37:11:247 | [INFO] |  | ASU | PIM | Utilities |  |  | 3400 | Directory not present

06/16/17 11:37:11:247 | [INFO] |  | ASU | PIM | PIM |  |  | 3400 | ERROR Failed Delete backed up assets

06/16/17 11:37:11:247 | [INFO] |  | ASU | PIM | PIM |  |  | 3400 | Trying to delete back up folder 'C:\Program Files (x86)\Common Files\Adobe\OOBE\PDApp\LWA_bkp1'

06/16/17 11:37:11:340 | [INFO] |  | ASU | PIM | PIM |  |  | 3400 | SUCCESS installPackage at file C:\WINDOWS\ccmcache\j\Setup\CPTV10.0\packages\LWA\LWA.pimx.

06/16/17 11:37:11:356 | [INFO] |  | ASU | PIM | PIM |  |  | 3400 | START installPackage at file C:\WINDOWS\ccmcache\j\Setup\CPTV10.0\packages\UWA\UWA.pimx

06/16/17 11:37:11:356 | [INFO] |  | ASU | PIM | PIM |  |  | 3400 | XML is valid

06/16/17 11:37:11:356 | [WARN] |  | ASU | PIM | PIM |  |  | 3400 | Failed to find Node

06/16/17 11:37:11:356 | [INFO] |  | ASU | PIM | PIM |  |  | 3400 | NOTE package id 26AAFE59-2AED-42FA-BC89-D464375D7D36 is a Old Package, a newer package is installed in the system.

06/16/17 11:37:11:356 | [INFO] |  | ASU | PIM | PIM |  |  | 3400 | START installPackage at file C:\WINDOWS\ccmcache\j\Setup\CPTV10.0\packages\CCM\CCM.pimx

06/16/17 11:37:11:372 | [INFO] |  | ASU | PIM | PIM |  |  | 3400 | XML is valid

06/16/17 11:37:11:372 | [WARN] |  | ASU | PIM | PIM |  |  | 3400 | Failed to find Node

06/16/17 11:37:11:372 | [INFO] |  | ASU | PIM | PIM |  |  | 3400 | NOTE package id F8569346-D222-46B5-81BA-661752149042 is a Old Package, a newer package is installed in the system.

06/16/17 11:37:11:372 | [INFO] |  | ASU | PIM | PIM |  |  | 3400 | START installPackage at file C:\WINDOWS\ccmcache\j\Setup\CPTV10.0\packages\IPC\IPC.pimx

06/16/17 11:37:11:372 | [INFO] |  | ASU | PIM | PIM |  |  | 3400 | XML is valid

06/16/17 11:37:11:372 | [WARN] |  | ASU | PIM | PIM |  |  | 3400 | Failed to find Node

06/16/17 11:37:11:372 | [INFO] |  | ASU | PIM | PIM |  |  | 3400 | NOTE package id CA4E0356-60B7-4B4B-BAE0-A6E0537F6ECD is a Old Package, a newer package is installed in the system.

06/16/17 11:37:11:372 | [INFO] |  | ASU | PIM | PIM |  |  | 3400 | START installPackage at file C:\WINDOWS\ccmcache\j\Setup\CPTV10.0\packages\P7\P7.pimx

06/16/17 11:37:11:372 | [INFO] |  | ASU | PIM | PIM |  |  | 3400 | XML is valid

06/16/17 11:37:11:372 | [WARN] |  | ASU | PIM | PIM |  |  | 3400 | Failed to find Node

06/16/17 11:37:11:372 | [INFO] |  | ASU | PIM | PIM |  |  | 3400 | NOTE package id B5EA99F6-6556-4F6E-838F-696DCED8152E is a Old Package, a newer package is installed in the system.

06/16/17 11:37:11:387 | [INFO] |  | ASU | PIM | PIM |  |  | 3400 | Processing ... _pimCreateOrUpdateAAMInventory

06/16/17 11:37:11:387 | [INFO] |  | ASU | PIM | PIM |  |  | 3400 | Higher version of AAM Updater inventory is already present in the machine. So skipping the creation of AAM Updater Inventory

06/16/17 11:37:11:387 | [INFO] |  | ASU | PIM | PIM |  |  | 3400 | Return ... SUCCESS _pimCreateOrUpdateAAMInventory

06/16/17 11:37:11:387 | [INFO] |  | ASU | Setup | Setup |  |  | 3400 | TimeLog: End Installing. Now launching PDApp

06/16/17 11:37:11:903 | [INFO] |  | ASU | Setup | Setup |  |  | 3400 | Deployment File Path not specified in command line arguments. Skipping payload deployment part

06/16/17 11:37:11:903 | [INFO] |  | ASU | Setup |  |  |  | 3400 | Event Guid generated is: '8e1c952f-d419-4ebe-9461-4eca55e64726'

06/16/17 11:37:11:903 | [INFO] |  | ASU | Setup | Setup |  |  | 3400 | =================  End Adobe Setup. Exit code: 0  =================

06/16/17 11:37:11:903 | [INFO] |  | ASU | PIM | PIM |  |  | 3400 | PIMSqlite closeDB status 0

06/16/17 11:37:11:903 | [INFO] |  | ASU | PIM | PIM |  |  | 3400 | FREE PIM Instance ...

06/16/17 11:37:11:903 | [INFO] |  | ASU | Setup |  |  |  | 3400 | Waiting for the async thread to get the task completed

06/16/17 11:37:12:184 | [INFO] |  | ASU | Setup |  |  |  | 7484 | HTTP Request Status code 200.

06/16/17 11:37:12:184 | [INFO] |  | ASU | Setup |  |  |  | 9768 | The http request returned HTTP_Status:0 HttpCommunicator error:0

06/16/17 11:37:12:184 | [INFO] |  | ASU | Setup |  |  |  | 9768 | Event with guid '8e1c952f-d419-4ebe-9461-4eca55e64726' is being sent

06/16/17 11:37:12:200 | [INFO] |  | ASU | Setup |  |  |  | 9768 | GetIEProxyInfo - No default proxy present on the user machine

06/16/17 11:37:12:200 | [INFO] |  | ASU | Setup |  |  |  | 9768 | GetIEProxyInfo - Failed to get proxy for the url, error:12006

06/16/17 11:37:12:200 | [INFO] |  | ASU | Setup |  |  |  | 9768 | GetIEProxyInfo - proxy Url is

06/16/17 11:37:13:763 | [INFO] |  | ASU | Setup |  |  |  | 7484 | HTTP Request Status code 200.

06/16/17 11:37:13:763 | [INFO] |  | ASU | Setup |  |  |  | 9768 | The http request returned HTTP_Status:0 HttpCommunicator error:0

06/16/17 11:37:13:763 | [INFO] |  | ASU | Setup |  |  |  | 9768 | Async thread is completed. Now exiting from function.

06/16/17 11:37:13:795 | [INFO] |  | ASU | DeploymentManager | DeploymentManager |  |  | 5572 | Build Version - 1.12.0.27

06/16/17 11:37:13:795 | [INFO] |  | ASU | DeploymentManager | DeploymentManager |  |  | 5572 | Logging Level verbosity Set  to 4

06/16/17 11:37:13:795 | [INFO] |  | ASU | DeploymentManager | DeploymentManager |  |  | 5572 | The return code from the Bootstrapper Process is (0).

06/16/17 11:37:13:795 | [INFO] |  | ASU | DeploymentManager | DeploymentManager |  |  | 5572 | Correcting Dependencies in local db.

06/16/17 11:37:13:807 | [ERROR] |  | ASU | DeploymentManager | DeploymentManager |  |  | 5572 | Failed to delete payload information ({0FAC7130-BEC5-47A5-8813-1D339B8326ED}) from dependency data table in local media db- 

06/16/17 11:37:13:807 | [ERROR] |  | ASU | DeploymentManager | DeploymentManager |  |  | 5572 | Failed to Fix dependencies in media db

06/16/17 11:37:13:878 | [WARN] |  | ASU | DeploymentManager | DeploymentManager |  |  | 5572 | Failed to correct the dependencies. Installation May fail.

06/16/17 11:37:13:878 | [INFO] |  | ASU | DeploymentManager | DeploymentManager |  |  | 5572 | STEP 4: Starting to launch Adobe Installer.

06/16/17 11:37:13:885 | [INFO] |  | ASU | DeploymentManager | DeploymentManager |  |  | 5572 | Updated the deployment install language (en_GB) from the fallback map ...

06/16/17 11:37:13:887 | [INFO] |  | ASU | DeploymentManager | DeploymentManager |  |  | 5572 | No Conflict Process defined, skipping the conflict file creation ...

06/16/17 11:37:13:889 | [INFO] |  | ASU | DeploymentManager | DeploymentManager |  |  | 5572 | Obtained Adobe Common Folder Path.

06/16/17 11:37:13:889 | [INFO] |  | ASU | DeploymentManager | DeploymentManager |  |  | 5572 | Adobe Installer launch location is :: C:\Program Files (x86)\Common Files\Adobe\OOBE\PDApp\DECore\Setup.exe

06/16/17 11:37:13:889 | [INFO] |  | ASU | DeploymentManager | DeploymentManager |  |  | 5572 | deploymentFile = (C:\Users\boulos\AppData\Local\Temp\{AE261E27-75D6-4209-BB5E-7F3C60260EFD}\\{5DC3779E-EF98-4750-A4EF-CBC0A7EDC79F}), installSourcePath = (C:\WINDOWS\ccmcache\j\Setup\CPTV10.0)

06/16/17 11:37:15:984 | [INFO] |  | ASU | DeploymentManager | AAMEEUtilities |  |  | 5572 | Process creation completed.

06/16/17 11:37:15:984 | [FATAL] |  | ASU | DeploymentManager | DeploymentManager |  |  | 5572 | The return code from the Adobe Installer Process is (7).Stopping the installation process.

06/16/17 11:37:15:984 | [ERROR] |  | ASU | DeploymentManager | DeploymentManager |  |  | 5572 | Media Failed (CPTV10.0)

06/16/17 11:37:15:989 | [INFO] |  | ASU | DeploymentManager | DeploymentManager |  |  | 5572 | Starting to clean the partially installed payloads.

06/16/17 11:37:15:993 | [INFO] |  | ASU | DeploymentManager | DeploymentManager |  |  | 5572 | Delete Node Query - /InstallInfo/Medias/Media[0]/DeploymentInfo/DeploymentUninstall/Deployment/Payloads/Payload[@adobeCode="{3E272A93-C06B-4206-AD02-0EBE02535E20}"]

06/16/17 11:37:15:993 | [INFO] |  | ASU | DeploymentManager | DeploymentManager |  |  | 5572 | Delete Node Query - /InstallInfo/Medias/Media[0]/DeploymentInfo/DeploymentUninstall/Deployment/Payloads/Payload[@adobeCode="{4CED09CB-0C96-4EAE-83C4-7D9B9456E613}"]

06/16/17 11:37:15:993 | [INFO] |  | ASU | DeploymentManager | DeploymentManager |  |  | 5572 | Delete Node Query - /InstallInfo/Medias/Media[0]/DeploymentInfo/DeploymentUninstall/Deployment/Payloads/Payload[@adobeCode="{539B5BB0-18F9-11E2-BBBC-00215AEA26C9}"]

06/16/17 11:37:15:994 | [INFO] |  | ASU | DeploymentManager | DeploymentManager |  |  | 5572 | Delete Node Query - /InstallInfo/Medias/Media[0]/DeploymentInfo/DeploymentUninstall/Deployment/Payloads/Payload[@adobeCode="{54B0C34F-18F9-11E2-BC1D-00215AEA26C9}"]

06/16/17 11:37:15:994 | [INFO] |  | ASU | DeploymentManager | DeploymentManager |  |  | 5572 | Delete Node Query - /InstallInfo/Medias/Media[0]/DeploymentInfo/DeploymentUninstall/Deployment/Payloads/Payload[@adobeCode="{55B82130-18F9-11E2-8D43-00215AEA26C9}"]

06/16/17 11:37:15:994 | [INFO] |  | ASU | DeploymentManager | DeploymentManager |  |  | 5572 | Delete Node Query - /InstallInfo/Medias/Media[0]/DeploymentInfo/DeploymentUninstall/Deployment/Payloads/Payload[@adobeCode="{636D196A-789E-455D-825E-3FA79F67D446}"]

06/16/17 11:37:15:994 | [INFO] |  | ASU | DeploymentManager | DeploymentManager |  |  | 5572 | Delete Node Query - /InstallInfo/Medias/Media[0]/DeploymentInfo/DeploymentUninstall/Deployment/Payloads/Payload[@adobeCode="{873BE68F-480F-49A6-9649-F98CAB056AFC}"]

06/16/17 11:37:16:037 | [INFO] |  | ASU | DeploymentManager | DeploymentManager |  |  | 5572 | Undeployment XML created at path :: C:\Users\boulos\AppData\Local\Temp\{AE261E27-75D6-4209-BB5E-7F3C60260EFD}\\{DDC142AB-91E1-4B24-BE0B-CAFE64C88786}

06/16/17 11:37:16:037 | [INFO] |  | ASU | DeploymentManager | DeploymentManager |  |  | 5572 | Starting to launch the Adobe Installer for uninstall mode.

06/16/17 11:37:16:037 | [INFO] |  | ASU | DeploymentManager | DeploymentManager |  |  | 5572 | Obtained Adobe Common Folder Path.

06/16/17 11:37:16:037 | [INFO] |  | ASU | DeploymentManager | DeploymentManager |  |  | 5572 | C:\Program Files (x86)\Common Files\Adobe\OOBE\PDApp\DECore\Setup.exe

06/16/17 11:37:17:216 | [INFO] |  | ASU | PIM-Uninstall | PIM-Uninstall |  |  | 8712 | Build Version - 9.0.0.266

06/16/17 11:37:17:216 | [INFO] |  | ASU | PIM-Uninstall | PIM-Uninstall |  |  | 8712 | Logging Level verbosity Set  to 4

06/16/17 11:37:17:232 | [INFO] |  | ASU | PIM-Uninstall | PIM-Uninstall |  |  | 8712 | Start: Adobe Application Manager Uninstall...

06/16/17 11:37:17:232 | [INFO] |  | ASU | PIM-Uninstall | PIM-Uninstall |  |  | 8712 | Get RIBS Product count

06/16/17 11:37:17:247 | [INFO] |  | ASU | PIM-Uninstall | PIM-Uninstall |  |  | 8712 | RIBS Products install status :1

06/16/17 11:37:17:247 | [INFO] |  | ASU | PIM-Uninstall | PIM-Uninstall |  |  | 8712 | There are some ribs products using AAM. RIBS product use flag is 1.

06/16/17 11:37:17:287 | [INFO] |  | ASU | DeploymentManager | AAMEEUtilities |  |  | 5572 | Process creation completed.

06/16/17 11:37:17:295 | [WARN] |  | ASU | DeploymentManager | DeploymentManager |  |  | 5572 | Skipping the provisioning tool invocation as workflow version is not appropriate ...

06/16/17 11:37:17:314 | [INFO] |  | ASU | OPM | OPM |  |  | 5572 | Build Version - 10.0.0.99

06/16/17 11:37:17:314 | [INFO] |  | ASU | OPM | OPM |  |  | 5572 | Logging Level verbosity Set  to 4

06/16/17 11:37:17:315 | [INFO] |  | ASU | OPM | OPM |  |  | 5572 | Schema version and schema compatibility version are same or greater than current

06/16/17 11:37:17:360 | [INFO] |  | ASU | OPM | OPM |  |  | 5572 | _opm_handle_OPDReturnedStatus called with opdStatus as:0

06/16/17 11:37:17:360 | [INFO] |  | ASU | OPM | OPM |  |  | 5572 | No Record found for the input fields in opm_getValueForKey

06/16/17 11:37:17:507 | [INFO] |  | ASU | DeploymentManager | AAMEEUtilities |  |  | 5572 | The output of process received  in execWithOutput :

Microsoft Windows [Version 10.0.15063]

06/16/17 11:37:17:516 | [INFO] |  | ASU | DeploymentManager |  |  |  | 5572 | Event Guid generated is: 'bf8e3546-7ae8-4a23-8355-515b70d3fd30'

06/16/17 11:37:17:528 | [INFO] |  | ASU | DeploymentManager |  |  | HTTPConnector | 5572 | GetIEProxyInfo - Failed to get proxy for the url, error:12180

06/16/17 11:37:19:342 | [INFO] |  | ASU | DeploymentManager |  |  | HTTPConnector | 4764 | HTTP Request Status code 200.

06/16/17 11:37:19:343 | [INFO] |  | ASU | DeploymentManager |  |  | HTTPConnector | 5572 | The http request returned HTTP_Status:0 HttpCommunicator error:0

06/16/17 11:37:19:343 | [INFO] |  | ASU | DeploymentManager |  |  |  | 5572 | Waiting for the async thread to get the task completed

06/16/17 11:37:19:344 | [INFO] |  | ASU | DeploymentManager |  |  |  | 12240 | Async thread is completed. Now exiting from function.

06/16/17 11:37:19:425 | [INFO] |  | ASU | DeploymentManager | DeploymentManager |  |  | 5572 | The install workflow is terminating.

06/16/17 11:37:20:177 | [INFO] |  | ASU | MSIInvoker | AAMEEUtilities |  |  | 11380 | Process creation completed.

06/16/17 11:37:20:177 | [INFO] |  | ASU | MSIInvoker | MSIInvoker |  |  | 11380 |  The return Code from Create Process (1603).

06/16/17 11:37:28:618 | [INFO] |  | ASU | MSIInvoker | MSIInvoker |  |  | 11380 | Setup exiting with return code (6)

Likes

Translate

Translate

Report

Report
Community Guidelines
Be kind and respectful, give credit to the original source of content, and search for duplicates before posting. Learn more
Reply
Loading...
Jun 15, 2017 0
Adobe Employee ,
Jun 15, 2017

Copy link to clipboard

Copied

Thank you for the log files. Now this gives me an error 7 which means a critical component has failed to install.

To look into which critical component in particular is failing, I would need the contents of another log file for Captivate.log.gz located at

C:\Program Files (x86)\Common Files\Adobe\Installers

(.gz is a compressed file format and this would need to be extracted first using any utility)

0189014280

Likes

Translate

Translate

Report

Report
Community Guidelines
Be kind and respectful, give credit to the original source of content, and search for duplicates before posting. Learn more
Reply
Loading...
Jun 15, 2017 2
Community Beginner ,
Jun 18, 2017

Copy link to clipboard

Copied

Hey ankising​, that was really helpful, I opened the log file you mentioned and found an error about the language compitability, I re-packed the application using the "match OS Language" option and the installation went fine.

Thank you for your support

Likes

Translate

Translate

Report

Report
Community Guidelines
Be kind and respectful, give credit to the original source of content, and search for duplicates before posting. Learn more
Reply
Loading...
Jun 18, 2017 3